{"text_format":"1","workbook":"xlsx","n_sheets":5,"sheets":["szablon_moment_bazowy","instrukcja_obsługi_makr","Arkusz2","miesiące_2","Tabela miesiące"],"not_rendered":{"charts":0,"images":7,"macros":1,"external_links":0,"defined_names":5,"comments":1,"pivot_tables":0},"unopened":[],"bounds":{"document_bytes":16777216,"sheet_cells":100000,"rows_first":2000,"rows_last":500,"rows_between":2000,"halvings":0,"cell_chars":16384,"cell_head_chars":4096},"cells_cut":0,"cells_raw":0,"read":"whole","date_system":"1900"}

{"sheet":"szablon_moment_bazowy","index":0,"n_rows":62,"n_cols":35,"rows_kept":62,"cut":false,"hidden":false,"merged":[[7,0,7,16],[0,0,0,22],[3,0,3,22],[4,0,4,16],[5,0,5,16],[6,0,6,16],[2,0,2,16],[1,0,1,22],[8,0,8,16],[10,0,10,1],[10,5,10,6],[10,7,10,9],[10,10,10,12],[10,14,23,22],[11,5,11,6],[11,7,11,9],[11,10,11,12],[12,0,16,1],[12,2,16,3],[12,5,12,6],[12,7,12,9],[12,10,12,12],[13,5,13,6],[13,7,13,9],[13,10,13,12],[14,5,14,6],[14,7,14,9],[14,10,14,12],[15,5,15,6],[15,7,15,9],[15,10,15,12],[16,5,16,6],[16,7,16,9],[16,10,16,12],[17,5,17,6],[17,7,17,9],[17,10,17,12],[18,5,18,6],[18,7,18,9],[18,10,18,12],[19,5,19,6],[19,7,19,9],[19,10,19,12],[20,5,20,6],[20,7,20,9],[20,10,20,12],[21,5,21,6],[21,7,21,9],[21,10,21,12],[22,5,22,6],[22,7,22,9],[22,10,22,12],[23,5,23,9],[23,10,23,12],[26,0,26,1],[26,3,26,4],[26,6,26,7],[26,9,26,10],[26,12,26,13],[23,2,23,3],[26,33,26,34],[26,15,26,16],[26,18,26,19],[26,21,26,22],[26,24,26,25],[26,27,26,28],[26,30,26,31]]}
["Obliczenie danych dotyczących zatrudnienia na potrzeby określenia momentu bazowego",null,null,null,null,null,null,null,null,null,null,null,null,null,null,null,null,null,null,null,null,null,null,null,null,"$C$24"]
["Tabela pomocnicza do wyliczenia momentu bazowego - szczegółowa metoda wyliczenia znajduje się w dokumentach aplikacyjnych tj. w  Załączniku do Instrukcji wypełniania wniosku o przyznanie pomocy:\n  - Załącznik nr 1 - Informacje dotyczące wypełniania biznesplanu"]
[" Uwaga!\n Niniejszy szablon służy do przeliczenia zatrudnienia na potrzeby określenia momentu bazowego  dla naboru  wniosków o przyznanie pomocy (WoPP) od 28.02.2020 r. do 28.03.2020 r.\n W związku z powyższym pole wyboru dotyczące miesiąca złożenia WoPP zostało ograniczone do miesięcy:\n  - luty 2020,\n  - marzec 2020"]
["Instrukcja:"]
["1.Należy wprowadzać właściwe dane do pól zaznaczonych kolorem żółtym."]
["2.Należy wskazać miesiąc złożenia wniosku o przyznanie pomocy poprzez wybranie z listy rozwijanej. \n\n3.Następnie należy przejść do pola \"data rozpoczęcia  działalności gospodarczej i z listy rozwijanej wybrać datę. Nastąpi automatyczne\n   przeniesienie do pola z odpowiednią datą. Wpisanie wartości do pola spowoduje automatyczne uzupełnienie pól, począwszy od  wybranej daty do\n   końca okresu, wartościami \"1\" (osoba prowadząca działalność gospodarczą). \n   Pola wypełnione wartościami \"1\" można nadpisywać wartościami wyższymi  (np. w przypadku zatrudnienia pracowników), ale nie niższymi niż \"1\" (osoba \n   prowadząca działalność gospodarczą) .\n   W przypadku prowadzenia działalności gospodarczej szablon nie  pozwala na wpisanie wartości mniejszej niż \"1\" .\n4. Uwaga! W przypadku wybrania daty i umieszczenia wpisów, a następnie dokonania wyboru opcji \"(wybierz z listy)\"  (dotyczy pola \"data rozpoczęcia\n    działalności  gospodarczej\") , nastąpi wyczyszczenie wszystkich wcześniej dokonanych wpisów! Zmiana w polu \"Miesiąc złożenia WoPP i wybranie\n    innego miesiąca  również spowoduje wyczyszczenie wpisów ze wszystkich miesięcy arkusza."]
["5. W przypadku działalności prowadzonej krócej niż dwanaście miesięcy i rozpoczętej nie z pierwszym dniem danego miesiąca, pola dotyczące  dni, w których nie była jeszcze prowadzona działalność powinny być puste (nie mogą zawierać nawet wartości \"0\"). Natomiast od dnia rozpoczęcia działalności wszystkie pola powinny być wypełnione co najmniej wartością 1 (osoba prowadząca działalnośc gospodarczą).\n"]
["6. Dla dni wolnych od pracy należy przyjąć stan z poprzedzającego dnia roboczego, o ile w tym dniu nie została rozwiązana umowa  o pracę z pracownikiem."]
["7. Jeżeli liczba dni w miesiącu jest mniejsza niż 31 (dotyczy to np. miesiąca lutego) to w przypadku dni, dla których pole \"Średni poziom zatrudnienia w miesiącu\" ma kolor biały  nie należy wpisywać żadnych wartości! Wpis zostanie automatycznie usunięty!"]
[]
["Miesiąc złożenia \nWoPP",null,null,2,null,"Kolejne miesiące poprzedzające miesiąc złożenia WoPP",null,"Miesiąc",null,null,"Średni poziom zatrudnienia w miesiącu",null,null,null,"Do stanu zatrudnienia nie należy wliczać pracowników przebywających na urlopie: \n• bezpłatnym (kod świadczenia/przerwy 111);\n• macierzyńskim (kod świadczenia/przerwy 311; kod tytułu ubezpieczenia 12 40);\n• bezpłatnym w celu sprawowania opieki nad dzieckiem (np. urlop wychowawczy - kod świadczenia/przerwy 121,122; kod tytułu ubezpieczenia 12 11);\n• bezpłatnym udzielonym pracownikom powołanym do pełnienia określonych funkcji z wyboru \noraz\n• stażystów;\n• osób zatrudnionych w celu przygotowania zawodowego;\n• osób wykonujących pracę na podstawie innej niż umowa o pracę np. umowy zlecenia lub \n   umowy  o dzieło lub kontrakt menadżerski;\n• osób współpracujących (za osobę współpracującą w rozumieniu ustawy o systemie \n   ubezpieczeń  społecznych   uważa się małżonka, dzieci własne, dzieci drugiego małżonka i    \n   dzieci  przysposobione, rodziców, macochę i ojczyma oraz osoby przysposabiające, jeżeli \n   pozostają z  osobą prowadzącą działalność gospodarczą we wspólnym gospodarstwie\n   domowym i  współpracują z nią przy prowadzeniu tej działalności);\n• osób skazanych (w czasie odbywania kary pozbawienia wolności lub tymczasowego\n   aresztowania). "]
[null,null,null,null,null,{"$f":"1","v":1},null,{"$f":"VLOOKUP($D$11+1,'Tabela miesiące'!A2:B15,2)","v":"Styczeń_2020"},null,null,{"$f":"IF(B60>0,B60,\"\")","v":""}]
["Liczba miesięcy                  (w przypadku kiedy podmiot działa krócej niż 12 miesięcy wyświetli się faktyczna liczba miesięcy prowadzenia dzialalności)",null,{"$f":"SUM(B62:AI62)","v":0},null,null,{"$f":"1+F12","v":2},null,{"$f":"VLOOKUP($D$11+2,'Tabela miesiące'!A3:B15,2)","v":"Grudzień_2019"},null,null,{"$f":"IF(E60>0,E60,\"\")","v":""}]
[null,null,null,null,null,{"$f":"F13+1","v":3},null,{"$f":"VLOOKUP($D$11+3,'Tabela miesiące'!A$2:B$15,2)","v":"Listopad_2019"},null,null,{"$f":"IF(H60>0,H60,\"\")","v":""}]
[null,null,null,null,null,{"$f":"F14+1","v":4},null,{"$f":"VLOOKUP($D$11+4,'Tabela miesiące'!A$2:B$15,2)","v":"Październik_2019"},null,null,{"$f":"IF(K60>0,K60,\"\")","v":""}]
[null,null,null,null,null,5,null,{"$f":"VLOOKUP($D$11+5,'Tabela miesiące'!A$2:B$15,2)","v":"Wrzesień_2019"},null,null,{"$f":"IF(N60>0,N60,\"\")","v":""}]
[null,null,null,null,null,6,null,{"$f":"VLOOKUP($D$11+6,'Tabela miesiące'!A$2:B$15,2)","v":"Sierpień_2019"},null,null,{"$f":"IF(Q60>0,Q60,\"\")","v":""}]
[null,null,null,null,null,7,null,{"$f":"VLOOKUP($D$11+7,'Tabela miesiące'!A$2:B$15,2)","v":"Lipiec_2019"},null,null,{"$f":"IF(T60>0,T60,\"\")","v":""}]
[null,null,null,null,null,8,null,{"$f":"VLOOKUP($D$11+8,'Tabela miesiące'!A$2:B$15,2)","v":"Czerwiec_2019"},null,null,{"$f":"IF(W60>0,W60,\"\")","v":""}]
[null,null,null,null,null,9,null,{"$f":"VLOOKUP($D$11+9,'Tabela miesiące'!A$2:B$15,2)","v":"Maj_2019"},null,null,{"$f":"IF(Z60>0,Z60,\"\")","v":""}]
[null,null,null,null,null,10,null,{"$f":"VLOOKUP($D$11+10,'Tabela miesiące'!A$2:B$15,2)","v":"Kwiecień_2019"},null,null,{"$f":"IF(AC60>0,AC60,\"\")","v":""}]
[null,null,null,null,null,11,null,{"$f":"VLOOKUP($D$11+11,'Tabela miesiące'!A$2:B$15,2)","v":"Marzec_2019"},null,null,{"$f":"IF(AF60>0,AF60,\"\")","v":""}]
[null,null,null,null,null,12,null,{"$f":"VLOOKUP($D$11+12,'Tabela miesiące'!A$2:B$15,2)","v":"Luty_2019"},null,null,{"$f":"IF(AI60>0,AI60,\"\")","v":""}]
[null,"data rozpoczęcia działalności gospodarczej","(wybierz z listy)",null,null,"Średnia z okresu 12 miesięcy poprzedzajacych miesiąc złożenia wniosku",null,null,null,null,{"$f":"SUM(K12:M23)/C13","v":{"$error":"#DIV/0!"}}]
[]
[]
[{"$f":"H12","v":"Styczeń_2020"},null,null,{"$f":"H13","v":"Grudzień_2019"},null,null,{"$f":"H14","v":"Listopad_2019"},null,null,{"$f":"H15","v":"Październik_2019"},null,null,{"$f":"H16","v":"Wrzesień_2019"},null,null,{"$f":"H17","v":"Sierpień_2019"},null,null,{"$f":"H18","v":"Lipiec_2019"},null,null,{"$f":"H19","v":"Czerwiec_2019"},null,null,{"$f":"H20","v":"Maj_2019"},null,null,{"$f":"H21","v":"Kwiecień_2019"},null,null,{"$f":"H22","v":"Marzec_2019"},null,null,{"$f":"H23","v":"Luty_2019"}]
["Dni w miesiącu","Liczba osób pracujących w poszczególnych dniach miesiąca",null,"Dni w miesiącu","Liczba osób pracujących w poszczególnych dniach miesiąca",null,"Dni w miesiącu","Liczba osób pracujących w poszczególnych dniach miesiąca",null,"Dni w miesiącu","Liczba osób pracujących w poszczególnych dniach miesiąca",null,"Dni w miesiącu","Liczba osób pracujących w poszczególnych dniach miesiąca",null,"Dni w miesiącu","Liczba osób pracujących w poszczególnych dniach miesiąca",null,"Dni w miesiącu","Liczba osób pracujących w poszczególnych dniach miesiąca",null,"Dni w miesiącu","Liczba osób pracujących w poszczególnych dniach miesiąca",null,"Dni w miesiącu","Liczba osób pracujących w poszczególnych dniach miesiąca",null,"Dni w miesiącu","Liczba osób pracujących w poszczególnych dniach miesiąca",null,"Dni w miesiącu","Liczba osób pracujących w poszczególnych dniach miesiąca",null,"Dni w miesiącu","Liczba osób pracujących w poszczególnych dniach miesiąca"]
[1,null,null,1,null,null,1,null,null,1,null,null,1,null,null,1,null,null,1,null,null,1,null,null,1,null,null,1,null,null,1,null,null,1]
[2,null,null,2,null,null,2,null,null,2,null,null,2,null,null,2,null,null,2,null,null,2,null,null,2,null,null,2,null,null,2,null,null,2]
[3,null,null,3,null,null,3,null,null,3,null,null,3,null,null,3,null,null,3,null,null,3,null,null,3,null,null,3,null,null,3,null,null,3]
[4,null,null,4,null,null,4,null,null,4,null,null,4,null,null,4,null,null,4,null,null,4,null,null,4,null,null,4,null,null,4,null,null,4]
[5,null,null,5,null,null,5,null,null,5,null,null,5,null,null,5,null,null,5,null,null,5,null,null,5,null,null,5,null,null,5,null,null,5]
[6,null,null,6,null,null,6,null,null,6,null,null,6,null,null,6,null,null,6,null,null,6,null,null,6,null,null,6,null,null,6,null,null,6]
[7,null,null,7,null,null,7,null,null,7,null,null,7,null,null,7,null,null,7,null,null,7,null,null,7,null,null,7,null,null,7,null,null,7]
[8,null,null,8,null,null,8,null,null,8,null,null,8,null,null,8,null,null,8,null,null,8,null,null,8,null,null,8,null,null,8,null,null,8]
[9,null,null,9,null,null,9,null,null,9,null,null,9,null,null,9,null,null,9,null,null,9,null,null,9,null,null,9,null,null,9,null,null,9]
[10,null,null,10,null,null,10,null,null,10,null,null,10,null,null,10,null,null,10,null,null,10,null,null,10,null,null,10,null,null,10,null,null,10]
[11,null,null,11,null,null,11,null,null,11,null,null,11,null,null,11,null,null,11,null,null,11,null,null,11,null,null,11,null,null,11,null,null,11]
[12,null,null,12,null,null,12,null,null,12,null,null,12,null,null,12,null,null,12,null,null,12,null,null,12,null,null,12,null,null,12,null,null,12]
[13,null,null,13,null,null,13,null,null,13,null,null,13,null,null,13,null,null,13,null,null,13,null,null,13,null,null,13,null,null,13,null,null,13]
[14,null,null,14,null,null,14,null,null,14,null,null,14,null,null,14,null,null,14,null,null,14,null,null,14,null,null,14,null,null,14,null,null,14]
[15,null,null,15,null,null,15,null,null,15,null,null,15,null,null,15,null,null,15,null,null,15,null,null,15,null,null,15,null,null,15,null,null,15]
[16,null,null,16,null,null,16,null,null,16,null,null,16,null,null,16,null,null,16,null,null,16,null,null,16,null,null,16,null,null,16,null,null,16]
[17,null,null,17,null,null,17,null,null,17,null,null,17,null,null,17,null,null,17,null,null,17,null,null,17,null,null,17,null,null,17,null,null,17]
[18,null,null,18,null,null,18,null,null,18,null,null,18,null,null,18,null,null,18,null,null,18,null,null,18,null,null,18,null,null,18,null,null,18]
[19,null,null,19,null,null,19,null,null,19,null,null,19,null,null,19,null,null,19,null,null,19,null,null,19,null,null,19,null,null,19,null,null,19]
[20,null,null,20,null,null,20,null,null,20,null,null,20,null,null,20,null,null,20,null,null,20,null,null,20,null,null,20,null,null,20,null,null,20]
[21,null,null,21,null,null,21,null,null,21,null,null,21,null,null,21,null,null,21,null,null,21,null,null,21,null,null,21,null,null,21,null,null,21]
[22,null,null,22,null,null,22,null,null,22,null,null,22,null,null,22,null,null,22,null,null,22,null,null,22,null,null,22,null,null,22,null,null,22]
[23,null,null,23,null,null,23,null,null,23,null,null,23,null,null,23,null,null,23,null,null,23,null,null,23,null,null,23,null,null,23,null,null,23]
[24,null,null,24,null,null,24,null,null,24,null,null,24,null,null,24,null,null,24,null,null,24,null,null,24,null,null,24,null,null,24,null,null,24]
[25,null,null,25,null,null,25,null,null,25,null,null,25,null,null,25,null,null,25,null,null,25,null,null,25,null,null,25,null,null,25,null,null,25]
[26,null,null,26,null,null,26,null,null,26,null,null,26,null,null,26,null,null,26,null,null,26,null,null,26,null,null,26,null,null,26,null,null,26]
[27,null,null,27,null,null,27,null,null,27,null,null,27,null,null,27,null,null,27,null,null,27,null,null,27,null,null,27,null,null,27,null,null,27]
[28,null,null,28,null,null,28,null,null,28,null,null,28,null,null,28,null,null,28,null,null,28,null,null,28,null,null,28,null,null,28,null,null,28]
[{"$f":"IF(AND(A$27<>\"Luty_2019\"),A56+1,\"\")","v":29},null,null,{"$f":"IF(AND(D$27<>\"Luty_2020\",D$27<>\"Luty_2019\"),D56+1,\"\")","v":29},null,null,{"$f":"IF(AND(G$27<>\"Luty_2020\",G$27<>\"Luty_2019\"),G56+1,\"\")","v":29},null,null,{"$f":"IF(AND(J$27<>\"Luty_2020\",J$27<>\"Luty_2019\"),J56+1,\"\")","v":29},null,null,{"$f":"IF(AND(M$27<>\"Luty_2020\",M$27<>\"Luty_2019\"),M56+1,\"\")","v":29},null,null,{"$f":"IF(AND(P$27<>\"Luty_2020\",P$27<>\"Luty_2019\"),P56+1,\"\")","v":29},null,null,{"$f":"IF(AND(S$27<>\"Luty_2020\",S$27<>\"Luty_2019\"),S56+1,\"\")","v":29},null,null,{"$f":"IF(AND(V$27<>\"Luty_2020\",V$27<>\"Luty_2019\"),V56+1,\"\")","v":29},null,null,{"$f":"IF(AND(Y$27<>\"Luty_2020\",Y$27<>\"Luty_2019\"),Y56+1,\"\")","v":29},null,null,{"$f":"IF(AND(AB$27<>\"Luty_2020\",AB$27<>\"Luty_2019\"),AB56+1,\"\")","v":29},null,null,{"$f":"IF(AND(AE$27<>\"Luty_2020\",AE$27<>\"Luty_2019\"),AE56+1,\"\")","v":29},null,null,{"$f":"IF(AH$27<>\"Luty_2019\",AH56+1,\"\")","v":""}]
[{"$f":"IF(A27=\"Luty_2020\",\"\",A57+1)","v":30},null,null,{"$f":"IF(D57=29,D57+1,\"\")","v":30},null,null,{"$f":"IF(G57=29,G57+1,\"\")","v":30},null,null,{"$f":"IF(J57=29,J57+1,\"\")","v":30},null,null,{"$f":"IF(M57=29,M57+1,\"\")","v":30},null,null,{"$f":"IF(P57=29,P57+1,\"\")","v":30},null,null,{"$f":"IF(S57=29,S57+1,\"\")","v":30},null,null,{"$f":"IF(V57=29,V57+1,\"\")","v":30},null,null,{"$f":"IF(Y57=29,Y57+1,\"\")","v":30},null,null,{"$f":"IF(AB57=29,AB57+1,\"\")","v":30},null,null,{"$f":"IF(AE57=29,AE57+1,\"\")","v":30},null,null,{"$f":"IF(AH57=29,AH57+1,\"\")","v":""}]
[{"$f":"IF(AND(A58=30,A27<>\"Kwiecień_2019\",A27<>\"Czerwiec_2019\",A27<>\"Wrzesień_2019\",A27<>\"Listopad_2019\"),A58+1,\"\")","v":31},null,null,{"$f":"IF(AND(D58=30,D27<>\"Kwiecień_2019\",D27<>\"Czerwiec_2019\",D27<>\"Wrzesień_2019\",D27<>\"Listopad_2019\"),D58+1,\"\")","v":31},null,null,{"$f":"IF(AND(G58=30,G27<>\"Kwiecień_2019\",G27<>\"Czerwiec_2019\",G27<>\"Wrzesień_2019\",G27<>\"Listopad_2019\"),G58+1,\"\")","v":""},null,null,{"$f":"IF(AND(J58=30,J27<>\"Kwiecień_2019\",J27<>\"Czerwiec_2019\",J27<>\"Wrzesień_2019\",J27<>\"Listopad_2019\"),J58+1,\"\")","v":31},null,null,{"$f":"IF(AND(M58=30,M27<>\"Kwiecień_2019\",M27<>\"Czerwiec_2019\",M27<>\"Wrzesień_2019\",M27<>\"Listopad_2019\"),M58+1,\"\")","v":""},null,null,{"$f":"IF(AND(P58=30,P27<>\"Kwiecień_2019\",P27<>\"Czerwiec_2019\",P27<>\"Wrzesień_2019\",P27<>\"Listopad_2019\"),P58+1,\"\")","v":31},null,null,{"$f":"IF(AND(S58=30,S27<>\"Kwiecień_2019\",S27<>\"Czerwiec_2019\",S27<>\"Wrzesień_2019\",S27<>\"Listopad_2019\"),S58+1,\"\")","v":31},null,null,{"$f":"IF(AND(V58=30,V27<>\"Kwiecień_2019\",V27<>\"Czerwiec_2019\",V27<>\"Wrzesień_2019\",V27<>\"Listopad_2019\"),V58+1,\"\")","v":""},null,null,{"$f":"IF(AND(Y58=30,Y27<>\"Kwiecień_2019\",Y27<>\"Czerwiec_2019\",Y27<>\"Wrzesień_2019\",Y27<>\"Listopad_2019\"),Y58+1,\"\")","v":31},null,null,{"$f":"IF(AND(AB58=30,AB27<>\"Kwiecień_2019\",AB27<>\"Czerwiec_2019\",AB27<>\"Wrzesień_2019\",AB27<>\"Listopad_2019\"),AB58+1,\"\")","v":""},null,null,{"$f":"IF(AND(AE58=30,AE27<>\"Kwiecień_2019\",AE27<>\"Czerwiec_2019\",AE27<>\"Wrzesień_2019\",AE27<>\"Listopad_2019\"),AE58+1,\"\")","v":31},null,null,{"$f":"IF(AND(AH58=30,AH27<>\"Kwiecień_2019\",AH27<>\"Czerwiec_2019\",AH27<>\"Wrzesień_2019\",AH27<>\"Listopad_2019\"),AH58+1,\"\")","v":""}]
["Średni poziom zatrudn. w miesiącu",{"$f":"SUM(B29:B59)/(0.0000000001+SUBTOTAL(3,B29:B59))","v":0},null,"Średni poziom zatrudn. w miesiącu",{"$f":"SUM(E29:E59)/(0.0000000001+SUBTOTAL(3,E29:E59))","v":0},null,"Średni poziom zatrudn. w miesiącu",{"$f":"SUM(H29:H59)/(0.0000000001+SUBTOTAL(3,H29:H59))","v":0},null,"Średni poziom zatrudn. w miesiącu",{"$f":"SUM(K29:K59)/(0.0000000001+SUBTOTAL(3,K29:K59))","v":0},null,"Średni poziom zatrudn. w miesiącu",{"$f":"SUM(N29:N59)/(0.0000000001+SUBTOTAL(3,N29:N59))","v":0},null,"Średni poziom zatrudn. w miesiącu",{"$f":"SUM(Q29:Q59)/(0.0000000001+SUBTOTAL(3,Q29:Q59))","v":0},null,"Średni poziom zatrudn. w miesiącu",{"$f":"SUM(T29:T59)/(0.0000000001+SUBTOTAL(3,T29:T59))","v":0},null,"Średni poziom zatrudn. w miesiącu",{"$f":"SUM(W29:W59)/(0.0000000001+SUBTOTAL(3,W29:W59))","v":0},null,"Średni poziom zatrudn. w miesiącu",{"$f":"SUM(Z29:Z59)/(0.0000000001+SUBTOTAL(3,Z29:Z59))","v":0},null,"Średni poziom zatrudn. w miesiącu",{"$f":"SUM(AC29:AC59)/(0.0000000001+SUBTOTAL(3,AC29:AC59))","v":0},null,"Średni poziom zatrudn. w miesiącu",{"$f":"SUM(AF29:AF59)/(0.0000000001+SUBTOTAL(3,AF29:AF59))","v":0},null,"Średni poziom zatrudn. w miesiącu",{"$f":"SUM(AI29:AI59)/(0.0000000001+SUBTOTAL(3,AI29:AI59))","v":0}]
[]
[null,{"$f":"IF(OR(B60>0,E62=1),1,\"\")","v":""},null,null,{"$f":"IF(OR(E60>0,H62=1),1,\"\")","v":""},null,null,{"$f":"IF(OR(H60>0,K62=1),1,\"\")","v":""},null,null,{"$f":"IF(OR(K60>0,N62=1),1,\"\")","v":""},null,null,{"$f":"IF(OR(N60>0,Q62=1),1,\"\")","v":""},null,null,{"$f":"IF(OR(Q60>0,T62=1),1,\"\")","v":""},null,null,{"$f":"IF(OR(T60>0,W62=1),1,\"\")","v":""},null,null,{"$f":"IF(OR(W60>0,Z62=1),1,\"\")","v":""},null,null,{"$f":"IF(OR(Z60>0,AC62=1),1,\"\")","v":""},null,null,{"$f":"IF(OR(AC60>0,AF62=1),1,\"\")","v":""},null,null,{"$f":"IF(OR(AF60>0,AI62=1),1,\"\")","v":""},null,null,{"$f":"IF(AI60>0,1,\"\")","v":""}]

{"sheet":"instrukcja_obsługi_makr","index":1,"n_rows":274,"n_cols":6,"rows_kept":274,"cut":false,"hidden":false,"merged":[[0,0,0,18],[95,1,95,19],[89,0,89,19],[90,1,90,19],[92,1,92,19],[94,1,94,19],[9,1,9,17]]}
["Uwaga! Poniższy plik zawiera wbudowane makra! \""]
[]
[null,null,null,null,null,"Obsługę pliku Excel zawierającego makra wskazuje poniższa instrukcja:"]
[null,null,null,null,null,"Po zapoznaniu się z instrukcją proszę przejść do zakładki \"szablon_moment_bazowy\""]
[]
[null,null,"Poniżej zostały zamieszczone zrzuty z ekranu, obrazujące prawidłowy sposób pobrania i użytkowania pliku z wbudowanymi makrami."]
[]
[null,"Zrzut nr 1"]
[]
[null,"W przypadku plików z makrami (o rozszerzeniu .xlsm) nie należy wybierać opcji \"Otwórz za pomocą\". \nNależy zaznaczyć pole wyboru „Zapisz plik” i potwierdzić przyciskiem „OK”.Plik zostanie automatycznie zapisany na stacji roboczej użytkownika w folderze „Pobrane”."]
[]
[]
[]
[]
[]
[]
[]
[]
[]
[]
[]
[]
[]
[]
[]
[]
[]
[]
[]
[]
[]
[]
[]
[]
[]
[]
[]
[]
[]
[]
[]
[]
[]
[]
[]
[]
[]
[]
[]
[null,"Zrzut nr 2"]
[null,"Należy przejść do folderu „Pobrane” i otworzyć plik"]
[]
[]
[]
[]
[]
[]
[]
[]
[]
[]
[]
[]
[]
[]
[]
[]
[]
[]
[]
[]
[]
[]
[]
[]
[]
[]
[]
[]
[]
[]
[]
[]
[]
[]
[]
[]
[]
[]
["Włączanie makr po wyświetleniu paska komunikatów "]
[null,"Gdy zostanie otwarty plik zawierający makra, pojawi się żółty pasek komunikatów z ikoną tarczy i przyciskiem „Włącz zawartość”. Jeśli wiadomo, że makra pochodzą z wiarygodnego źródła, należy skorzystać z następujących instrukcji:"]
[]
[null,"• W obszarze Pasek komunikatów kliknij pozycję „Włącz zawartość”."]
[]
[null,"Zostanie otwarty plik, który jest dokumentem zaufanym."]
[null,"Poniższy obraz przedstawia przykład paska komunikatów, gdy w pliku znajdują się makra."]
[]
[]
[]
[]
[null,"W przypadku, gdy powyższy komunikat się nie pojawi, należy sprawdzić ustawienia makr dostępne z menu \"Plik\"."]
[]
[]
[null,"Zrzut nr 3"]
[null,"Należy wybrać menu \"Plik\" i przejść do pozycji \"Opcje\" i  przejść do \"Centrum zaufania \""]
[]
[]
[]
[]
[]
[]
[]
[]
[]
[]
[]
[]
[]
[]
[]
[]
[]
[]
[]
[]
[]
[]
[]
[]
[]
[]
[]
[]
[]
[]
[]
[]
[]
[]
[]
[]
[]
[]
[]
[]
[]
[]
[]
[]
[]
[]
[]
[]
[]
[]
[]
[]
[]
[]
[]
[]
[null,"Zrzut nr 4"]
[null,"Następnie należy  wybrać \"Ustawienia Centrum Zaufania\" i sprawdzić ustawienia paska komunikatów. (zrzut nr 5)"]
[]
[]
[]
[]
[]
[]
[]
[]
[]
[]
[]
[]
[]
[]
[]
[]
[]
[]
[]
[]
[]
[]
[]
[]
[]
[]
[]
[]
[]
[]
[]
[]
[]
[]
[]
[]
[]
[]
[]
[]
[]
[]
[]
[]
[]
[]
[]
[]
[]
[]
[]
[null,"Zrzut nr 5"]
[null,"Powinna być zaznaczona opcja \"Pokaż pasek komunikatów we wszystkich aplikacjach, jeśli zawartość aktywna, taka jak kontrolki AcitveX i makra, została zablokowana"]
[null,"a następnie wybrać  opcję \"Zawartość zewnętrzna\"."]
[]
[]
[]
[]
[]
[]
[]
[]
[]
[]
[]
[]
[]
[]
[]
[]
[]
[]
[]
[]
[]
[]
[]
[]
[]
[]
[]
[]
[]
[]
[]
[]
[]
[]
[]
[]
[]
[]
[]
[]
[]
[]
[]
[]
[]
[]
[]
[]
[]
[]
[]
[]
[]
[]
[]
[null,"Zrzut nr 6"]
[null,"Należy sprawdzić, czy zaznaczone są poniższe opcje."]

{"sheet":"Arkusz2","index":2,"n_rows":430,"n_cols":10,"rows_kept":430,"cut":false,"hidden":true,"merged":[]}
[1,"If [h12] = \"Luty_2020\" And [c24] <>","\"","01.03.2019"," \" And [ai29","] >= 1 And [ai30","]>=1 Then","[c24]=",{"$f":"CONCATENATE(C1,D1,\"\"\"\")","v":"\"01.03.2019\""},{"$f":"CONCATENATE(B1,C1,D1,E1,F1,G1)","v":"If [h12] = \"Luty_2020\" And [c24] <>\"01.03.2019 \" And [ai29] >= 1 And [ai30]>=1 Then"}]
[1.1000000000000001,null,null,null,null,null,null,null,null,{"$f":"CONCATENATE(H1,I1)","v":"[c24]=\"01.03.2019\""}]
[1.2,null,null,null,null,null,null,null,null,"End If"]
[2,"If [h12] = \"Luty_2020\" And [c24] <>","\"","02.03.2019"," \" And [ai30","] >= 1 And [ai29","]=\"\" Then","[c24]=",{"$f":"CONCATENATE(C4,D4,\"\"\"\")","v":"\"02.03.2019\""},{"$f":"CONCATENATE(B4,C4,D4,E4,F4,G4)","v":"If [h12] = \"Luty_2020\" And [c24] <>\"02.03.2019 \" And [ai30] >= 1 And [ai29]=\"\" Then"}]
[2.1,null,null,null,null,null,null,null,null,{"$f":"CONCATENATE(H4,I4)","v":"[c24]=\"02.03.2019\""}]
[2.2000000000000002,null,null,null,null,null,null,null,null,"End If"]
[3,"If [h12] = \"Luty_2020\" And [c24] <>","\"","03.03.2019"," \" And [ai31","] >= 1 And [ai32","]=\"\" Then","[c24]=",{"$f":"CONCATENATE(C7,D7,\"\"\"\")","v":"\"03.03.2019\""},{"$f":"CONCATENATE(B7,C7,D7,E7,F7,G7)","v":"If [h12] = \"Luty_2020\" And [c24] <>\"03.03.2019 \" And [ai31] >= 1 And [ai32]=\"\" Then"}]
[3.1,null,null,null,null,null,null,null,null,{"$f":"CONCATENATE(H7,I7)","v":"[c24]=\"03.03.2019\""}]
[3.2,null,null,null,null,null,null,null,null,"End If"]
[4,"If [h12] = \"Luty_2020\" And [c24] <>","\"","04.03.2019"," \" And [ai32","] >= 1 And [ai33","]=\"\" Then","[c24]=",{"$f":"CONCATENATE(C10,D10,\"\"\"\")","v":"\"04.03.2019\""},{"$f":"CONCATENATE(B10,C10,D10,E10,F10,G10)","v":"If [h12] = \"Luty_2020\" And [c24] <>\"04.03.2019 \" And [ai32] >= 1 And [ai33]=\"\" Then"}]
[4.0999999999999996,null,null,null,null,null,null,null,null,{"$f":"CONCATENATE(H10,I10)","v":"[c24]=\"04.03.2019\""}]
[4.2,null,null,null,null,null,null,null,null,"End If"]
[5,"If [h12] = \"Luty_2020\" And [c24] <>","\"","05.03.2019"," \" And [ai33","] >= 1 And [ai34","]=\"\" Then","[c24]=",{"$f":"CONCATENATE(C13,D13,\"\"\"\")","v":"\"05.03.2019\""},{"$f":"CONCATENATE(B13,C13,D13,E13,F13,G13)","v":"If [h12] = \"Luty_2020\" And [c24] <>\"05.03.2019 \" And [ai33] >= 1 And [ai34]=\"\" Then"}]
[5.0999999999999996,null,null,null,null,null,null,null,null,{"$f":"CONCATENATE(H13,I13)","v":"[c24]=\"05.03.2019\""}]
[5.2,null,null,null,null,null,null,null,null,"End If"]
[6,"If [h12] = \"Luty_2020\" And [c24] <>","\"","06.03.2019"," \" And [ai34","] >= 1 And [ai35","]=\"\" Then","[c24]=",{"$f":"CONCATENATE(C16,D16,\"\"\"\")","v":"\"06.03.2019\""},{"$f":"CONCATENATE(B16,C16,D16,E16,F16,G16)","v":"If [h12] = \"Luty_2020\" And [c24] <>\"06.03.2019 \" And [ai34] >= 1 And [ai35]=\"\" Then"}]
[6.1,null,null,null,null,null,null,null,null,{"$f":"CONCATENATE(H16,I16)","v":"[c24]=\"06.03.2019\""}]
[6.2,null,null,null,null,null,null,null,null,"End If"]
[7,"If [h12] = \"Luty_2020\" And [c24] <>","\"","07.03.2019"," \" And [ai35","] >= 1 And [ai36","]=\"\" Then","[c24]=",{"$f":"CONCATENATE(C19,D19,\"\"\"\")","v":"\"07.03.2019\""},{"$f":"CONCATENATE(B19,C19,D19,E19,F19,G19)","v":"If [h12] = \"Luty_2020\" And [c24] <>\"07.03.2019 \" And [ai35] >= 1 And [ai36]=\"\" Then"}]
[7.1,null,null,null,null,null,null,null,null,{"$f":"CONCATENATE(H19,I19)","v":"[c24]=\"07.03.2019\""}]
[7.2,null,null,null,null,null,null,null,null,"End If"]
[8,"If [h12] = \"Luty_2020\" And [c24] <>","\"","08.03.2019"," \" And [ai36","] >= 1 And [ai37","]=\"\" Then","[c24]=",{"$f":"CONCATENATE(C22,D22,\"\"\"\")","v":"\"08.03.2019\""},{"$f":"CONCATENATE(B22,C22,D22,E22,F22,G22)","v":"If [h12] = \"Luty_2020\" And [c24] <>\"08.03.2019 \" And [ai36] >= 1 And [ai37]=\"\" Then"}]
[8.1,null,null,null,null,null,null,null,null,{"$f":"CONCATENATE(H22,I22)","v":"[c24]=\"08.03.2019\""}]
[8.1999999999999993,null,null,null,null,null,null,null,null,"End If"]
[9,"If [h12] = \"Luty_2020\" And [c24] <>","\"","09.03.2019"," \" And [ai37","] >= 1 And [ai38","]=\"\" Then","[c24]=",{"$f":"CONCATENATE(C25,D25,\"\"\"\")","v":"\"09.03.2019\""},{"$f":"CONCATENATE(B25,C25,D25,E25,F25,G25)","v":"If [h12] = \"Luty_2020\" And [c24] <>\"09.03.2019 \" And [ai37] >= 1 And [ai38]=\"\" Then"}]
[9.1,null,null,null,null,null,null,null,null,{"$f":"CONCATENATE(H25,I25)","v":"[c24]=\"09.03.2019\""}]
[9.1999999999999993,null,null,null,null,null,null,null,null,"End If"]
[10,"If [h12] = \"Luty_2020\" And [c24] <>","\"","10.03.2019"," \" And [ai38","] >= 1 And [ai39","]=\"\" Then","[c24]=",{"$f":"CONCATENATE(C28,D28,\"\"\"\")","v":"\"10.03.2019\""},{"$f":"CONCATENATE(B28,C28,D28,E28,F28,G28)","v":"If [h12] = \"Luty_2020\" And [c24] <>\"10.03.2019 \" And [ai38] >= 1 And [ai39]=\"\" Then"}]
[10.1,null,null,null,null,null,null,null,null,{"$f":"CONCATENATE(H28,I28)","v":"[c24]=\"10.03.2019\""}]
[10.199999999999999,null,null,null,null,null,null,null,null,"End If"]
[11,"If [h12] = \"Luty_2020\" And [c24] <>","\"","11.03.2019"," \" And [ai39","] >= 1 And [ai40","]=\"\" Then","[c24]=",{"$f":"CONCATENATE(C31,D31,\"\"\"\")","v":"\"11.03.2019\""},{"$f":"CONCATENATE(B31,C31,D31,E31,F31,G31)","v":"If [h12] = \"Luty_2020\" And [c24] <>\"11.03.2019 \" And [ai39] >= 1 And [ai40]=\"\" Then"}]
[11.1,null,null,null,null,null,null,null,null,{"$f":"CONCATENATE(H31,I31)","v":"[c24]=\"11.03.2019\""}]
[11.2,null,null,null,null,null,null,null,null,"End If"]
[12,"If [h12] = \"Luty_2020\" And [c24] <>","\"","12.03.2019"," \" And [ai40","] >= 1 And [ai41","]=\"\" Then","[c24]=",{"$f":"CONCATENATE(C34,D34,\"\"\"\")","v":"\"12.03.2019\""},{"$f":"CONCATENATE(B34,C34,D34,E34,F34,G34)","v":"If [h12] = \"Luty_2020\" And [c24] <>\"12.03.2019 \" And [ai40] >= 1 And [ai41]=\"\" Then"}]
[12.1,null,null,null,null,null,null,null,null,{"$f":"CONCATENATE(H34,I34)","v":"[c24]=\"12.03.2019\""}]
[12.2,null,null,null,null,null,null,null,null,"End If"]
[13,"If [h12] = \"Luty_2020\" And [c24] <>","\"","13.03.2019"," \" And [ai41","] >= 1 And [ai42","]=\"\" Then","[c24]=",{"$f":"CONCATENATE(C37,D37,\"\"\"\")","v":"\"13.03.2019\""},{"$f":"CONCATENATE(B37,C37,D37,E37,F37,G37)","v":"If [h12] = \"Luty_2020\" And [c24] <>\"13.03.2019 \" And [ai41] >= 1 And [ai42]=\"\" Then"}]
[13.1,null,null,null,null,null,null,null,null,{"$f":"CONCATENATE(H37,I37)","v":"[c24]=\"13.03.2019\""}]
[13.2,null,null,null,null,null,null,null,null,"End If"]
[14,"If [h12] = \"Luty_2020\" And [c24] <>","\"","14.03.2019"," \" And [ai42","] >= 1 And [ai43","]=\"\" Then","[c24]=",{"$f":"CONCATENATE(C40,D40,\"\"\"\")","v":"\"14.03.2019\""},{"$f":"CONCATENATE(B40,C40,D40,E40,F40,G40)","v":"If [h12] = \"Luty_2020\" And [c24] <>\"14.03.2019 \" And [ai42] >= 1 And [ai43]=\"\" Then"}]
[14.1,null,null,null,null,null,null,null,null,{"$f":"CONCATENATE(H40,I40)","v":"[c24]=\"14.03.2019\""}]
[14.2,null,null,null,null,null,null,null,null,"End If"]
[15,"If [h12] = \"Luty_2020\" And [c24] <>","\"","15.03.2019"," \" And [ai43","] >= 1 And [ai44","]=\"\" Then","[c24]=",{"$f":"CONCATENATE(C43,D43,\"\"\"\")","v":"\"15.03.2019\""},{"$f":"CONCATENATE(B43,C43,D43,E43,F43,G43)","v":"If [h12] = \"Luty_2020\" And [c24] <>\"15.03.2019 \" And [ai43] >= 1 And [ai44]=\"\" Then"}]
[15.1,null,null,null,null,null,null,null,null,{"$f":"CONCATENATE(H43,I43)","v":"[c24]=\"15.03.2019\""}]
[15.2,null,null,null,null,null,null,null,null,"End If"]
[16,"If [h12] = \"Luty_2020\" And [c24] <>","\"","16.03.2019"," \" And [ai44","] >= 1 And [ai45","]=\"\" Then","[c24]=",{"$f":"CONCATENATE(C46,D46,\"\"\"\")","v":"\"16.03.2019\""},{"$f":"CONCATENATE(B46,C46,D46,E46,F46,G46)","v":"If [h12] = \"Luty_2020\" And [c24] <>\"16.03.2019 \" And [ai44] >= 1 And [ai45]=\"\" Then"}]
[16.100000000000001,null,null,null,null,null,null,null,null,{"$f":"CONCATENATE(H46,I46)","v":"[c24]=\"16.03.2019\""}]
[16.2,null,null,null,null,null,null,null,null,"End If"]
[17,"If [h12] = \"Luty_2020\" And [c24] <>","\"","17.03.2019"," \" And [ai45","] >= 1 And [ai46","]=\"\" Then","[c24]=",{"$f":"CONCATENATE(C49,D49,\"\"\"\")","v":"\"17.03.2019\""},{"$f":"CONCATENATE(B49,C49,D49,E49,F49,G49)","v":"If [h12] = \"Luty_2020\" And [c24] <>\"17.03.2019 \" And [ai45] >= 1 And [ai46]=\"\" Then"}]
[17.100000000000001,null,null,null,null,null,null,null,null,{"$f":"CONCATENATE(H49,I49)","v":"[c24]=\"17.03.2019\""}]
[17.2,null,null,null,null,null,null,null,null,"End If"]
[18,"If [h12] = \"Luty_2020\" And [c24] <>","\"","18.03.2019"," \" And [ai46","] >= 1 And [ai47","]=\"\" Then","[c24]=",{"$f":"CONCATENATE(C52,D52,\"\"\"\")","v":"\"18.03.2019\""},{"$f":"CONCATENATE(B52,C52,D52,E52,F52,G52)","v":"If [h12] = \"Luty_2020\" And [c24] <>\"18.03.2019 \" And [ai46] >= 1 And [ai47]=\"\" Then"}]
[18.100000000000001,null,null,null,null,null,null,null,null,{"$f":"CONCATENATE(H52,I52)","v":"[c24]=\"18.03.2019\""}]
[18.2,null,null,null,null,null,null,null,null,"End If"]
[19,"If [h12] = \"Luty_2020\" And [c24] <>","\"","19.03.2019"," \" And [ai47","] >= 1 And [ai48","]=\"\" Then","[c24]=",{"$f":"CONCATENATE(C55,D55,\"\"\"\")","v":"\"19.03.2019\""},{"$f":"CONCATENATE(B55,C55,D55,E55,F55,G55)","v":"If [h12] = \"Luty_2020\" And [c24] <>\"19.03.2019 \" And [ai47] >= 1 And [ai48]=\"\" Then"}]
[19.100000000000001,null,null,null,null,null,null,null,null,{"$f":"CONCATENATE(H55,I55)","v":"[c24]=\"19.03.2019\""}]
[19.2,null,null,null,null,null,null,null,null,"End If"]
[20,"If [h12] = \"Luty_2020\" And [c24] <>","\"","20.03.2019"," \" And [ai48","] >= 1 And [ai49","]=\"\" Then","[c24]=",{"$f":"CONCATENATE(C58,D58,\"\"\"\")","v":"\"20.03.2019\""},{"$f":"CONCATENATE(B58,C58,D58,E58,F58,G58)","v":"If [h12] = \"Luty_2020\" And [c24] <>\"20.03.2019 \" And [ai48] >= 1 And [ai49]=\"\" Then"}]
[20.100000000000001,null,null,null,null,null,null,null,null,{"$f":"CONCATENATE(H58,I58)","v":"[c24]=\"20.03.2019\""}]
[20.2,null,null,null,null,null,null,null,null,"End If"]
[21,"If [h12] = \"Luty_2020\" And [c24] <>","\"","21.03.2019"," \" And [ai49","] >= 1 And [ai50","]=\"\" Then","[c24]=",{"$f":"CONCATENATE(C61,D61,\"\"\"\")","v":"\"21.03.2019\""},{"$f":"CONCATENATE(B61,C61,D61,E61,F61,G61)","v":"If [h12] = \"Luty_2020\" And [c24] <>\"21.03.2019 \" And [ai49] >= 1 And [ai50]=\"\" Then"}]
[21.1,null,null,null,null,null,null,null,null,{"$f":"CONCATENATE(H61,I61)","v":"[c24]=\"21.03.2019\""}]
[21.2,null,null,null,null,null,null,null,null,"End If"]
[22,"If [h12] = \"Luty_2020\" And [c24] <>","\"","22.03.2019"," \" And [ai50","] >= 1 And [ai51","]=\"\" Then","[c24]=",{"$f":"CONCATENATE(C64,D64,\"\"\"\")","v":"\"22.03.2019\""},{"$f":"CONCATENATE(B64,C64,D64,E64,F64,G64)","v":"If [h12] = \"Luty_2020\" And [c24] <>\"22.03.2019 \" And [ai50] >= 1 And [ai51]=\"\" Then"}]
[22.1,null,null,null,null,null,null,null,null,{"$f":"CONCATENATE(H64,I64)","v":"[c24]=\"22.03.2019\""}]
[22.2,null,null,null,null,null,null,null,null,"End If"]
[23,"If [h12] = \"Luty_2020\" And [c24] <>","\"","23.03.2019"," \" And [ai51","] >= 1 And [ai52","]=\"\" Then","[c24]=",{"$f":"CONCATENATE(C67,D67,\"\"\"\")","v":"\"23.03.2019\""},{"$f":"CONCATENATE(B67,C67,D67,E67,F67,G67)","v":"If [h12] = \"Luty_2020\" And [c24] <>\"23.03.2019 \" And [ai51] >= 1 And [ai52]=\"\" Then"}]
[23.1,null,null,null,null,null,null,null,null,{"$f":"CONCATENATE(H67,I67)","v":"[c24]=\"23.03.2019\""}]
[23.2,null,null,null,null,null,null,null,null,"End If"]
[24,"If [h12] = \"Luty_2020\" And [c24] <>","\"","24.03.2019"," \" And [ai52","] >= 1 And [ai53","]=\"\" Then","[c24]=",{"$f":"CONCATENATE(C70,D70,\"\"\"\")","v":"\"24.03.2019\""},{"$f":"CONCATENATE(B70,C70,D70,E70,F70,G70)","v":"If [h12] = \"Luty_2020\" And [c24] <>\"24.03.2019 \" And [ai52] >= 1 And [ai53]=\"\" Then"}]
[24.1,null,null,null,null,null,null,null,null,{"$f":"CONCATENATE(H70,I70)","v":"[c24]=\"24.03.2019\""}]
[24.2,null,null,null,null,null,null,null,null,"End If"]
[25,"If [h12] = \"Luty_2020\" And [c24] <>","\"","25.03.2019"," \" And [ai53","] >= 1 And [ai54","]=\"\" Then","[c24]=",{"$f":"CONCATENATE(C73,D73,\"\"\"\")","v":"\"25.03.2019\""},{"$f":"CONCATENATE(B73,C73,D73,E73,F73,G73)","v":"If [h12] = \"Luty_2020\" And [c24] <>\"25.03.2019 \" And [ai53] >= 1 And [ai54]=\"\" Then"}]
[25.1,null,null,null,null,null,null,null,null,{"$f":"CONCATENATE(H73,I73)","v":"[c24]=\"25.03.2019\""}]
[25.2,null,null,null,null,null,null,null,null,"End If"]
[26,"If [h12] = \"Luty_2020\" And [c24] <>","\"","26.03.2019"," \" And [ai54","] >= 1 And [ai55","]=\"\" Then","[c24]=",{"$f":"CONCATENATE(C76,D76,\"\"\"\")","v":"\"26.03.2019\""},{"$f":"CONCATENATE(B76,C76,D76,E76,F76,G76)","v":"If [h12] = \"Luty_2020\" And [c24] <>\"26.03.2019 \" And [ai54] >= 1 And [ai55]=\"\" Then"}]
[26.1,null,null,null,null,null,null,null,null,{"$f":"CONCATENATE(H76,I76)","v":"[c24]=\"26.03.2019\""}]
[26.2,null,null,null,null,null,null,null,null,"End If"]
[27,"If [h12] = \"Luty_2020\" And [c24] <>","\"","27.03.2019"," \" And [ai55","] >= 1 And [ai56","]=\"\" Then","[c24]=",{"$f":"CONCATENATE(C79,D79,\"\"\"\")","v":"\"27.03.2019\""},{"$f":"CONCATENATE(B79,C79,D79,E79,F79,G79)","v":"If [h12] = \"Luty_2020\" And [c24] <>\"27.03.2019 \" And [ai55] >= 1 And [ai56]=\"\" Then"}]
[27.1,null,null,null,null,null,null,null,null,{"$f":"CONCATENATE(H79,I79)","v":"[c24]=\"27.03.2019\""}]
[27.2,null,null,null,null,null,null,null,null,"End If"]
[28,"If [h12] = \"Luty_2020\" And [c24] <>","\"","28.03.2019"," \" And [ai56","] >= 1 And [ai57","]=\"\" Then","[c24]=",{"$f":"CONCATENATE(C82,D82,\"\"\"\")","v":"\"28.03.2019\""},{"$f":"CONCATENATE(B82,C82,D82,E82,F82,G82)","v":"If [h12] = \"Luty_2020\" And [c24] <>\"28.03.2019 \" And [ai56] >= 1 And [ai57]=\"\" Then"}]
[28.1,null,null,null,null,null,null,null,null,{"$f":"CONCATENATE(H82,I82)","v":"[c24]=\"28.03.2019\""}]
[28.2,null,null,null,null,null,null,null,null,"End If"]
[29,"If [h12] = \"Luty_2020\" And [c24] <>","\"","29.03.2019"," \" And [ai57","] >= 1 And [ai58","]=\"\" Then","[c24]=",{"$f":"CONCATENATE(C85,D85,\"\"\"\")","v":"\"29.03.2019\""},{"$f":"CONCATENATE(B85,C85,D85,E85,F85,G85)","v":"If [h12] = \"Luty_2020\" And [c24] <>\"29.03.2019 \" And [ai57] >= 1 And [ai58]=\"\" Then"}]
[29.1,null,null,null,null,null,null,null,null,{"$f":"CONCATENATE(H85,I85)","v":"[c24]=\"29.03.2019\""}]
[29.2,null,null,null,null,null,null,null,null,"End If"]
[30,"If [h12] = \"Luty_2020\" And [c24] <>","\"","30.03.2019"," \" And [ai58","] >= 1 And [ai59","]=\"\" Then","[c24]=",{"$f":"CONCATENATE(C88,D88,\"\"\"\")","v":"\"30.03.2019\""},{"$f":"CONCATENATE(B88,C88,D88,E88,F88,G88)","v":"If [h12] = \"Luty_2020\" And [c24] <>\"30.03.2019 \" And [ai58] >= 1 And [ai59]=\"\" Then"}]
[null,null,null,null,null,null,null,null,null,{"$f":"CONCATENATE(H88,I88)","v":"[c24]=\"30.03.2019\""}]
[null,null,null,null,null,null,null,null,null,"End If"]
[31,"If [h12] = \"Luty_2020\" And [c24] <>","\"","31.03.2019"," \" And [ai59","] >= 1 And [ai60","]<>\"\" Then","[c24]=",{"$f":"CONCATENATE(C91,D91,\"\"\"\")","v":"\"31.03.2019\""},{"$f":"CONCATENATE(B91,C91,D91,E91,F91,G91)","v":"If [h12] = \"Luty_2020\" And [c24] <>\"31.03.2019 \" And [ai59] >= 1 And [ai60]<>\"\" Then"}]
[null,null,null,null,null,null,null,null,null,"[c24]=\"31.03.2019\""]
[null,null,null,null,null,null,null,null,null,"End If"]
[]
[]
[null,null,null,"01.04.2019"]
[null,null,null,"02.04.2019"]
[null,null,null,"03.04.2019"]
[null,null,null,"04.04.2019"]
[null,null,null,"05.04.2019"]
[null,null,null,"06.04.2019"]
[null,null,null,"07.04.2019"]
[null,null,null,"08.04.2019"]
[null,null,null,"09.04.2019"]
[null,null,null,"10.04.2019"]
[null,null,null,"11.04.2019"]
[null,null,null,"12.04.2019"]
[null,null,null,"13.04.2019"]
[null,null,null,"14.04.2019"]
[null,null,null,"15.04.2019"]
[null,null,null,"16.04.2019"]
[null,null,null,"17.04.2019"]
[null,null,null,"18.04.2019"]
[null,null,null,"19.04.2019"]
[null,null,null,"20.04.2019"]
[null,null,null,"21.04.2019"]
[null,null,null,"22.04.2019"]
[null,null,null,"23.04.2019"]
[null,null,null,"24.04.2019"]
[null,null,null,"25.04.2019"]
[null,null,null,"26.04.2019"]
[null,null,null,"27.04.2019"]
[null,null,null,"28.04.2019"]
[null,null,null,"29.04.2019"]
[null,null,null,"30.04.2019"]
[null,null,null,"01.05.2019"]
[null,null,null,"02.05.2019"]
[null,null,null,"03.05.2019"]
[null,null,null,"04.05.2019"]
[null,null,null,"05.05.2019"]
[null,null,null,"06.05.2019"]
[null,null,null,"07.05.2019"]
[null,null,null,"08.05.2019"]
[null,null,null,"09.05.2019"]
[null,null,null,"10.05.2019"]
[null,null,null,"11.05.2019"]
[null,null,null,"12.05.2019"]
[null,null,null,"13.05.2019"]
[null,null,null,"14.05.2019"]
[null,null,null,"15.05.2019"]
[null,null,null,"16.05.2019"]
[null,null,null,"17.05.2019"]
[null,null,null,"18.05.2019"]
[null,null,null,"19.05.2019"]
[null,null,null,"20.05.2019"]
[null,null,null,"21.05.2019"]
[null,null,null,"22.05.2019"]
[null,null,null,"23.05.2019"]
[null,null,null,"24.05.2019"]
[null,null,null,"25.05.2019"]
[null,null,null,"26.05.2019"]
[null,null,null,"27.05.2019"]
[null,null,null,"28.05.2019"]
[null,null,null,"29.05.2019"]
[null,null,null,"30.05.2019"]
[null,null,null,"31.05.2019"]
[null,null,null,"01.06.2019"]
[null,null,null,"02.06.2019"]
[null,null,null,"03.06.2019"]
[null,null,null,"04.06.2019"]
[null,null,null,"05.06.2019"]
[null,null,null,"06.06.2019"]
[null,null,null,"07.06.2019"]
[null,null,null,"08.06.2019"]
[null,null,null,"09.06.2019"]
[null,null,null,"10.06.2019"]
[null,null,null,"11.06.2019"]
[null,null,null,"12.06.2019"]
[null,null,null,"13.06.2019"]
[null,null,null,"14.06.2019"]
[null,null,null,"15.06.2019"]
[null,null,null,"16.06.2019"]
[null,null,null,"17.06.2019"]
[null,null,null,"18.06.2019"]
[null,null,null,"19.06.2019"]
[null,null,null,"20.06.2019"]
[null,null,null,"21.06.2019"]
[null,null,null,"22.06.2019"]
[null,null,null,"23.06.2019"]
[null,null,null,"24.06.2019"]
[null,null,null,"25.06.2019"]
[null,null,null,"26.06.2019"]
[null,null,null,"27.06.2019"]
[null,null,null,"28.06.2019"]
[null,null,null,"29.06.2019"]
[null,null,null,"30.06.2019"]
[null,null,null,"01.07.2019"]
[null,null,null,"02.07.2019"]
[null,null,null,"03.07.2019"]
[null,null,null,"04.07.2019"]
[null,null,null,"05.07.2019"]
[null,null,null,"06.07.2019"]
[null,null,null,"07.07.2019"]
[null,null,null,"08.07.2019"]
[null,null,null,"09.07.2019"]
[null,null,null,"10.07.2019"]
[null,null,null,"11.07.2019"]
[null,null,null,"12.07.2019"]
[null,null,null,"13.07.2019"]
[null,null,null,"14.07.2019"]
[null,null,null,"15.07.2019"]
[null,null,null,"16.07.2019"]
[null,null,null,"17.07.2019"]
[null,null,null,"18.07.2019"]
[null,null,null,"19.07.2019"]
[null,null,null,"20.07.2019"]
[null,null,null,"21.07.2019"]
[null,null,null,"22.07.2019"]
[null,null,null,"23.07.2019"]
[null,null,null,"24.07.2019"]
[null,null,null,"25.07.2019"]
[null,null,null,"26.07.2019"]
[null,null,null,"27.07.2019"]
[null,null,null,"28.07.2019"]
[null,null,null,"29.07.2019"]
[null,null,null,"30.07.2019"]
[null,null,null,"31.07.2019"]
[null,null,null,"01.08.2019"]
[null,null,null,"02.08.2019"]
[null,null,null,"03.08.2019"]
[null,null,null,"04.08.2019"]
[null,null,null,"05.08.2019"]
[null,null,null,"06.08.2019"]
[null,null,null,"07.08.2019"]
[null,null,null,"08.08.2019"]
[null,null,null,"09.08.2019"]
[null,null,null,"10.08.2019"]
[null,null,null,"11.08.2019"]
[null,null,null,"12.08.2019"]
[null,null,null,"13.08.2019"]
[null,null,null,"14.08.2019"]
[null,null,null,"15.08.2019"]
[null,null,null,"16.08.2019"]
[null,null,null,"17.08.2019"]
[null,null,null,"18.08.2019"]
[null,null,null,"19.08.2019"]
[null,null,null,"20.08.2019"]
[null,null,null,"21.08.2019"]
[null,null,null,"22.08.2019"]
[null,null,null,"23.08.2019"]
[null,null,null,"24.08.2019"]
[null,null,null,"25.08.2019"]
[null,null,null,"26.08.2019"]
[null,null,null,"27.08.2019"]
[null,null,null,"28.08.2019"]
[null,null,null,"29.08.2019"]
[null,null,null,"30.08.2019"]
[null,null,null,"31.08.2019"]
[null,null,null,"01.09.2019"]
[null,null,null,"02.09.2019"]
[null,null,null,"03.09.2019"]
[null,null,null,"04.09.2019"]
[null,null,null,"05.09.2019"]
[null,null,null,"06.09.2019"]
[null,null,null,"07.09.2019"]
[null,null,null,"08.09.2019"]
[null,null,null,"09.09.2019"]
[null,null,null,"10.09.2019"]
[null,null,null,"11.09.2019"]
[null,null,null,"12.09.2019"]
[null,null,null,"13.09.2019"]
[null,null,null,"14.09.2019"]
[null,null,null,"15.09.2019"]
[null,null,null,"16.09.2019"]
[null,null,null,"17.09.2019"]
[null,null,null,"18.09.2019"]
[null,null,null,"19.09.2019"]
[null,null,null,"20.09.2019"]
[null,null,null,"21.09.2019"]
[null,null,null,"22.09.2019"]
[null,null,null,"23.09.2019"]
[null,null,null,"24.09.2019"]
[null,null,null,"25.09.2019"]
[null,null,null,"26.09.2019"]
[null,null,null,"27.09.2019"]
[null,null,null,"28.09.2019"]
[null,null,null,"29.09.2019"]
[null,null,null,"30.09.2019"]
[null,null,null,"01.10.2019"]
[null,null,null,"02.10.2019"]
[null,null,null,"03.10.2019"]
[null,null,null,"04.10.2019"]
[null,null,null,"05.10.2019"]
[null,null,null,"06.10.2019"]
[null,null,null,"07.10.2019"]
[null,null,null,"08.10.2019"]
[null,null,null,"09.10.2019"]
[null,null,null,"10.10.2019"]
[null,null,null,"11.10.2019"]
[null,null,null,"12.10.2019"]
[null,null,null,"13.10.2019"]
[null,null,null,"14.10.2019"]
[null,null,null,"15.10.2019"]
[null,null,null,"16.10.2019"]
[null,null,null,"17.10.2019"]
[null,null,null,"18.10.2019"]
[null,null,null,"19.10.2019"]
[null,null,null,"20.10.2019"]
[null,null,null,"21.10.2019"]
[null,null,null,"22.10.2019"]
[null,null,null,"23.10.2019"]
[null,null,null,"24.10.2019"]
[null,null,null,"25.10.2019"]
[null,null,null,"26.10.2019"]
[null,null,null,"27.10.2019"]
[null,null,null,"28.10.2019"]
[null,null,null,"29.10.2019"]
[null,null,null,"30.10.2019"]
[null,null,null,"31.10.2019"]
[null,null,null,"01.11.2019"]
[null,null,null,"02.11.2019"]
[null,null,null,"03.11.2019"]
[null,null,null,"04.11.2019"]
[null,null,null,"05.11.2019"]
[null,null,null,"06.11.2019"]
[null,null,null,"07.11.2019"]
[null,null,null,"08.11.2019"]
[null,null,null,"09.11.2019"]
[null,null,null,"10.11.2019"]
[null,null,null,"11.11.2019"]
[null,null,null,"12.11.2019"]
[null,null,null,"13.11.2019"]
[null,null,null,"14.11.2019"]
[null,null,null,"15.11.2019"]
[null,null,null,"16.11.2019"]
[null,null,null,"17.11.2019"]
[null,null,null,"18.11.2019"]
[null,null,null,"19.11.2019"]
[null,null,null,"20.11.2019"]
[null,null,null,"21.11.2019"]
[null,null,null,"22.11.2019"]
[null,null,null,"23.11.2019"]
[null,null,null,"24.11.2019"]
[null,null,null,"25.11.2019"]
[null,null,null,"26.11.2019"]
[null,null,null,"27.11.2019"]
[null,null,null,"28.11.2019"]
[null,null,null,"29.11.2019"]
[null,null,null,"30.11.2019"]
[null,null,null,"01.12.2019"]
[null,null,null,"02.12.2019"]
[null,null,null,"03.12.2019"]
[null,null,null,"04.12.2019"]
[null,null,null,"05.12.2019"]
[null,null,null,"06.12.2019"]
[null,null,null,"07.12.2019"]
[null,null,null,"08.12.2019"]
[null,null,null,"09.12.2019"]
[null,null,null,"10.12.2019"]
[null,null,null,"11.12.2019"]
[null,null,null,"12.12.2019"]
[null,null,null,"13.12.2019"]
[null,null,null,"14.12.2019"]
[null,null,null,"15.12.2019"]
[null,null,null,"16.12.2019"]
[null,null,null,"17.12.2019"]
[null,null,null,"18.12.2019"]
[null,null,null,"19.12.2019"]
[null,null,null,"20.12.2019"]
[null,null,null,"21.12.2019"]
[null,null,null,"22.12.2019"]
[null,null,null,"23.12.2019"]
[null,null,null,"24.12.2019"]
[null,null,null,"25.12.2019"]
[null,null,null,"26.12.2019"]
[null,null,null,"27.12.2019"]
[null,null,null,"28.12.2019"]
[null,null,null,"29.12.2019"]
[null,null,null,"30.12.2019"]
[null,null,null,"31.12.2019"]
[null,null,null,"01.01.2020"]
[null,null,null,"02.01.2020"]
[null,null,null,"03.01.2020"]
[null,null,null,"04.01.2020"]
[null,null,null,"05.01.2020"]
[null,null,null,"06.01.2020"]
[null,null,null,"07.01.2020"]
[null,null,null,"08.01.2020"]
[null,null,null,"09.01.2020"]
[null,null,null,"10.01.2020"]
[null,null,null,"11.01.2020"]
[null,null,null,"12.01.2020"]
[null,null,null,"13.01.2020"]
[null,null,null,"14.01.2020"]
[null,null,null,"15.01.2020"]
[null,null,null,"16.01.2020"]
[null,null,null,"17.01.2020"]
[null,null,null,"18.01.2020"]
[null,null,null,"19.01.2020"]
[null,null,null,"20.01.2020"]
[null,null,null,"21.01.2020"]
[null,null,null,"22.01.2020"]
[null,null,null,"23.01.2020"]
[null,null,null,"24.01.2020"]
[null,null,null,"25.01.2020"]
[null,null,null,"26.01.2020"]
[null,null,null,"27.01.2020"]
[null,null,null,"28.01.2020"]
[null,null,null,"29.01.2020"]
[null,null,null,"30.01.2020"]
[null,null,null,"31.01.2020"]
[null,null,null,"01.02.2020"]
[null,null,null,"02.02.2020"]
[null,null,null,"03.02.2020"]
[null,null,null,"04.02.2020"]
[null,null,null,"05.02.2020"]
[null,null,null,"06.02.2020"]
[null,null,null,"07.02.2020"]
[null,null,null,"08.02.2020"]
[null,null,null,"09.02.2020"]
[null,null,null,"10.02.2020"]
[null,null,null,"11.02.2020"]
[null,null,null,"12.02.2020"]
[null,null,null,"13.02.2020"]
[null,null,null,"14.02.2020"]
[null,null,null,"15.02.2020"]
[null,null,null,"16.02.2020"]
[null,null,null,"17.02.2020"]
[null,null,null,"18.02.2020"]
[null,null,null,"19.02.2020"]
[null,null,null,"20.02.2020"]
[null,null,null,"21.02.2020"]
[null,null,null,"22.02.2020"]
[null,null,null,"23.02.2020"]
[null,null,null,"24.02.2020"]
[null,null,null,"25.02.2020"]
[null,null,null,"26.02.2020"]
[null,null,null,"27.02.2020"]
[null,null,null,"28.02.2020"]
[null,null,null,"29.02.2020"]

{"sheet":"miesiące_2","index":3,"n_rows":368,"n_cols":6,"rows_kept":368,"cut":false,"hidden":true,"merged":[]}
[null,null,"Marzec_2020","Luty_2020"]
[null,{"$f":"IF(szablon_moment_bazowy!$H$12=\"Styczeń_2020\",miesiące_2!D2,C2)","v":"(wybierz z listy)"},"(wybierz z listy)","(wybierz z listy)"]
[null,{"$f":"IF(szablon_moment_bazowy!$H$12=\"Styczeń_2020\",miesiące_2!D3,C3)","v":"2019-02-01"},"2019-03-01","2019-02-01",null,{"$f":"TEXT(C3,\"dd.mm.rrrrr\")","v":"01.03.2019"}]
[null,{"$f":"IF(szablon_moment_bazowy!$H$12=\"Styczeń_2020\",miesiące_2!D4,C4)","v":"2019-02-02"},"2019-03-02","2019-02-02",null,{"$f":"TEXT(C4,\"dd.mm.rrrrr\")","v":"02.03.2019"}]
[null,{"$f":"IF(szablon_moment_bazowy!$H$12=\"Styczeń_2020\",miesiące_2!D5,C5)","v":"2019-02-03"},"2019-03-03","2019-02-03",null,"03.03.2019"]
[null,{"$f":"IF(szablon_moment_bazowy!$H$12=\"Styczeń_2020\",miesiące_2!D6,C6)","v":"2019-02-04"},"2019-03-04","2019-02-04",null,"04.03.2019"]
[null,{"$f":"IF(szablon_moment_bazowy!$H$12=\"Styczeń_2020\",miesiące_2!D7,C7)","v":"2019-02-05"},"2019-03-05","2019-02-05",null,"05.03.2019"]
[null,{"$f":"IF(szablon_moment_bazowy!$H$12=\"Styczeń_2020\",miesiące_2!D8,C8)","v":"2019-02-06"},"2019-03-06","2019-02-06",null,"06.03.2019"]
[null,{"$f":"IF(szablon_moment_bazowy!$H$12=\"Styczeń_2020\",miesiące_2!D9,C9)","v":"2019-02-07"},"2019-03-07","2019-02-07",null,"07.03.2019"]
[null,{"$f":"IF(szablon_moment_bazowy!$H$12=\"Styczeń_2020\",miesiące_2!D10,C10)","v":"2019-02-08"},"2019-03-08","2019-02-08",null,"08.03.2019"]
[null,{"$f":"IF(szablon_moment_bazowy!$H$12=\"Styczeń_2020\",miesiące_2!D11,C11)","v":"2019-02-09"},"2019-03-09","2019-02-09",null,"09.03.2019"]
[null,{"$f":"IF(szablon_moment_bazowy!$H$12=\"Styczeń_2020\",miesiące_2!D12,C12)","v":"2019-02-10"},"2019-03-10","2019-02-10",null,"10.03.2019"]
[null,{"$f":"IF(szablon_moment_bazowy!$H$12=\"Styczeń_2020\",miesiące_2!D13,C13)","v":"2019-02-11"},"2019-03-11","2019-02-11",null,"11.03.2019"]
[null,{"$f":"IF(szablon_moment_bazowy!$H$12=\"Styczeń_2020\",miesiące_2!D14,C14)","v":"2019-02-12"},"2019-03-12","2019-02-12",null,"12.03.2019"]
[null,{"$f":"IF(szablon_moment_bazowy!$H$12=\"Styczeń_2020\",miesiące_2!D15,C15)","v":"2019-02-13"},"2019-03-13","2019-02-13",null,"13.03.2019"]
[null,{"$f":"IF(szablon_moment_bazowy!$H$12=\"Styczeń_2020\",miesiące_2!D16,C16)","v":"2019-02-14"},"2019-03-14","2019-02-14",null,"14.03.2019"]
[null,{"$f":"IF(szablon_moment_bazowy!$H$12=\"Styczeń_2020\",miesiące_2!D17,C17)","v":"2019-02-15"},"2019-03-15","2019-02-15",null,"15.03.2019"]
[null,{"$f":"IF(szablon_moment_bazowy!$H$12=\"Styczeń_2020\",miesiące_2!D18,C18)","v":"2019-02-16"},"2019-03-16","2019-02-16",null,"16.03.2019"]
[null,{"$f":"IF(szablon_moment_bazowy!$H$12=\"Styczeń_2020\",miesiące_2!D19,C19)","v":"2019-02-17"},"2019-03-17","2019-02-17",null,"17.03.2019"]
[null,{"$f":"IF(szablon_moment_bazowy!$H$12=\"Styczeń_2020\",miesiące_2!D20,C20)","v":"2019-02-18"},"2019-03-18","2019-02-18",null,"18.03.2019"]
[null,{"$f":"IF(szablon_moment_bazowy!$H$12=\"Styczeń_2020\",miesiące_2!D21,C21)","v":"2019-02-19"},"2019-03-19","2019-02-19",null,"19.03.2019"]
[null,{"$f":"IF(szablon_moment_bazowy!$H$12=\"Styczeń_2020\",miesiące_2!D22,C22)","v":"2019-02-20"},"2019-03-20","2019-02-20",null,"20.03.2019"]
[null,{"$f":"IF(szablon_moment_bazowy!$H$12=\"Styczeń_2020\",miesiące_2!D23,C23)","v":"2019-02-21"},"2019-03-21","2019-02-21",null,"21.03.2019"]
[null,{"$f":"IF(szablon_moment_bazowy!$H$12=\"Styczeń_2020\",miesiące_2!D24,C24)","v":"2019-02-22"},"2019-03-22","2019-02-22",null,"22.03.2019"]
[null,{"$f":"IF(szablon_moment_bazowy!$H$12=\"Styczeń_2020\",miesiące_2!D25,C25)","v":"2019-02-23"},"2019-03-23","2019-02-23",null,"23.03.2019"]
[null,{"$f":"IF(szablon_moment_bazowy!$H$12=\"Styczeń_2020\",miesiące_2!D26,C26)","v":"2019-02-24"},"2019-03-24","2019-02-24",null,"24.03.2019"]
[null,{"$f":"IF(szablon_moment_bazowy!$H$12=\"Styczeń_2020\",miesiące_2!D27,C27)","v":"2019-02-25"},"2019-03-25","2019-02-25",null,"25.03.2019"]
[null,{"$f":"IF(szablon_moment_bazowy!$H$12=\"Styczeń_2020\",miesiące_2!D28,C28)","v":"2019-02-26"},"2019-03-26","2019-02-26",null,"26.03.2019"]
[null,{"$f":"IF(szablon_moment_bazowy!$H$12=\"Styczeń_2020\",miesiące_2!D29,C29)","v":"2019-02-27"},"2019-03-27","2019-02-27",null,"27.03.2019"]
[null,{"$f":"IF(szablon_moment_bazowy!$H$12=\"Styczeń_2020\",miesiące_2!D30,C30)","v":"2019-02-28"},"2019-03-28","2019-02-28",null,"28.03.2019"]
[null,{"$f":"IF(szablon_moment_bazowy!$H$12=\"Styczeń_2020\",miesiące_2!D31,C31)","v":"2019-03-01"},"2019-03-29","2019-03-01",null,"29.03.2019"]
[null,{"$f":"IF(szablon_moment_bazowy!$H$12=\"Styczeń_2020\",miesiące_2!D32,C32)","v":"2019-03-02"},"2019-03-30","2019-03-02",null,"30.03.2019"]
[null,{"$f":"IF(szablon_moment_bazowy!$H$12=\"Styczeń_2020\",miesiące_2!D33,C33)","v":"2019-03-03"},"2019-03-31","2019-03-03",null,"31.03.2019"]
[null,{"$f":"IF(szablon_moment_bazowy!$H$12=\"Styczeń_2020\",miesiące_2!D34,C34)","v":"2019-03-04"},"2019-04-01","2019-03-04",null,"01.04.2019"]
[null,{"$f":"IF(szablon_moment_bazowy!$H$12=\"Styczeń_2020\",miesiące_2!D35,C35)","v":"2019-03-05"},"2019-04-02","2019-03-05",null,"02.04.2019"]
[null,{"$f":"IF(szablon_moment_bazowy!$H$12=\"Styczeń_2020\",miesiące_2!D36,C36)","v":"2019-03-06"},"2019-04-03","2019-03-06",null,"03.04.2019"]
[null,{"$f":"IF(szablon_moment_bazowy!$H$12=\"Styczeń_2020\",miesiące_2!D37,C37)","v":"2019-03-07"},"2019-04-04","2019-03-07",null,"04.04.2019"]
[null,{"$f":"IF(szablon_moment_bazowy!$H$12=\"Styczeń_2020\",miesiące_2!D38,C38)","v":"2019-03-08"},"2019-04-05","2019-03-08",null,"05.04.2019"]
[null,{"$f":"IF(szablon_moment_bazowy!$H$12=\"Styczeń_2020\",miesiące_2!D39,C39)","v":"2019-03-09"},"2019-04-06","2019-03-09",null,"06.04.2019"]
[null,{"$f":"IF(szablon_moment_bazowy!$H$12=\"Styczeń_2020\",miesiące_2!D40,C40)","v":"2019-03-10"},"2019-04-07","2019-03-10",null,"07.04.2019"]
[null,{"$f":"IF(szablon_moment_bazowy!$H$12=\"Styczeń_2020\",miesiące_2!D41,C41)","v":"2019-03-11"},"2019-04-08","2019-03-11",null,"08.04.2019"]
[null,{"$f":"IF(szablon_moment_bazowy!$H$12=\"Styczeń_2020\",miesiące_2!D42,C42)","v":"2019-03-12"},"2019-04-09","2019-03-12",null,"09.04.2019"]
[null,{"$f":"IF(szablon_moment_bazowy!$H$12=\"Styczeń_2020\",miesiące_2!D43,C43)","v":"2019-03-13"},"2019-04-10","2019-03-13",null,"10.04.2019"]
[null,{"$f":"IF(szablon_moment_bazowy!$H$12=\"Styczeń_2020\",miesiące_2!D44,C44)","v":"2019-03-14"},"2019-04-11","2019-03-14",null,"11.04.2019"]
[null,{"$f":"IF(szablon_moment_bazowy!$H$12=\"Styczeń_2020\",miesiące_2!D45,C45)","v":"2019-03-15"},"2019-04-12","2019-03-15",null,"12.04.2019"]
[null,{"$f":"IF(szablon_moment_bazowy!$H$12=\"Styczeń_2020\",miesiące_2!D46,C46)","v":"2019-03-16"},"2019-04-13","2019-03-16",null,"13.04.2019"]
[null,{"$f":"IF(szablon_moment_bazowy!$H$12=\"Styczeń_2020\",miesiące_2!D47,C47)","v":"2019-03-17"},"2019-04-14","2019-03-17",null,"14.04.2019"]
[null,{"$f":"IF(szablon_moment_bazowy!$H$12=\"Styczeń_2020\",miesiące_2!D48,C48)","v":"2019-03-18"},"2019-04-15","2019-03-18",null,"15.04.2019"]
[null,{"$f":"IF(szablon_moment_bazowy!$H$12=\"Styczeń_2020\",miesiące_2!D49,C49)","v":"2019-03-19"},"2019-04-16","2019-03-19",null,"16.04.2019"]
[null,{"$f":"IF(szablon_moment_bazowy!$H$12=\"Styczeń_2020\",miesiące_2!D50,C50)","v":"2019-03-20"},"2019-04-17","2019-03-20",null,"17.04.2019"]
[null,{"$f":"IF(szablon_moment_bazowy!$H$12=\"Styczeń_2020\",miesiące_2!D51,C51)","v":"2019-03-21"},"2019-04-18","2019-03-21",null,"18.04.2019"]
[null,{"$f":"IF(szablon_moment_bazowy!$H$12=\"Styczeń_2020\",miesiące_2!D52,C52)","v":"2019-03-22"},"2019-04-19","2019-03-22",null,"19.04.2019"]
[null,{"$f":"IF(szablon_moment_bazowy!$H$12=\"Styczeń_2020\",miesiące_2!D53,C53)","v":"2019-03-23"},"2019-04-20","2019-03-23",null,"20.04.2019"]
[null,{"$f":"IF(szablon_moment_bazowy!$H$12=\"Styczeń_2020\",miesiące_2!D54,C54)","v":"2019-03-24"},"2019-04-21","2019-03-24",null,"21.04.2019"]
[null,{"$f":"IF(szablon_moment_bazowy!$H$12=\"Styczeń_2020\",miesiące_2!D55,C55)","v":"2019-03-25"},"2019-04-22","2019-03-25",null,"22.04.2019"]
[null,{"$f":"IF(szablon_moment_bazowy!$H$12=\"Styczeń_2020\",miesiące_2!D56,C56)","v":"2019-03-26"},"2019-04-23","2019-03-26",null,"23.04.2019"]
[null,{"$f":"IF(szablon_moment_bazowy!$H$12=\"Styczeń_2020\",miesiące_2!D57,C57)","v":"2019-03-27"},"2019-04-24","2019-03-27",null,"24.04.2019"]
[null,{"$f":"IF(szablon_moment_bazowy!$H$12=\"Styczeń_2020\",miesiące_2!D58,C58)","v":"2019-03-28"},"2019-04-25","2019-03-28",null,"25.04.2019"]
[null,{"$f":"IF(szablon_moment_bazowy!$H$12=\"Styczeń_2020\",miesiące_2!D59,C59)","v":"2019-03-29"},"2019-04-26","2019-03-29",null,"26.04.2019"]
[null,{"$f":"IF(szablon_moment_bazowy!$H$12=\"Styczeń_2020\",miesiące_2!D60,C60)","v":"2019-03-30"},"2019-04-27","2019-03-30",null,"27.04.2019"]
[null,{"$f":"IF(szablon_moment_bazowy!$H$12=\"Styczeń_2020\",miesiące_2!D61,C61)","v":"2019-03-31"},"2019-04-28","2019-03-31",null,"28.04.2019"]
[null,{"$f":"IF(szablon_moment_bazowy!$H$12=\"Styczeń_2020\",miesiące_2!D62,C62)","v":"2019-04-01"},"2019-04-29","2019-04-01",null,"29.04.2019"]
[null,{"$f":"IF(szablon_moment_bazowy!$H$12=\"Styczeń_2020\",miesiące_2!D63,C63)","v":"2019-04-02"},"2019-04-30","2019-04-02",null,"30.04.2019"]
[null,{"$f":"IF(szablon_moment_bazowy!$H$12=\"Styczeń_2020\",miesiące_2!D64,C64)","v":"2019-04-03"},"2019-05-01","2019-04-03",null,"01.05.2019"]
[null,{"$f":"IF(szablon_moment_bazowy!$H$12=\"Styczeń_2020\",miesiące_2!D65,C65)","v":"2019-04-04"},"2019-05-02","2019-04-04",null,"02.05.2019"]
[null,{"$f":"IF(szablon_moment_bazowy!$H$12=\"Styczeń_2020\",miesiące_2!D66,C66)","v":"2019-04-05"},"2019-05-03","2019-04-05",null,"03.05.2019"]
[null,{"$f":"IF(szablon_moment_bazowy!$H$12=\"Styczeń_2020\",miesiące_2!D67,C67)","v":"2019-04-06"},"2019-05-04","2019-04-06",null,"04.05.2019"]
[null,{"$f":"IF(szablon_moment_bazowy!$H$12=\"Styczeń_2020\",miesiące_2!D68,C68)","v":"2019-04-07"},"2019-05-05","2019-04-07",null,{"$f":"TEXT(C68,\"dd.mm.rrrrr\")","v":"05.05.2019"}]
[null,{"$f":"IF(szablon_moment_bazowy!$H$12=\"Styczeń_2020\",miesiące_2!D69,C69)","v":"2019-04-08"},"2019-05-06","2019-04-08",null,"06.05.2019"]
[null,{"$f":"IF(szablon_moment_bazowy!$H$12=\"Styczeń_2020\",miesiące_2!D70,C70)","v":"2019-04-09"},"2019-05-07","2019-04-09",null,"07.05.2019"]
[null,{"$f":"IF(szablon_moment_bazowy!$H$12=\"Styczeń_2020\",miesiące_2!D71,C71)","v":"2019-04-10"},"2019-05-08","2019-04-10",null,"08.05.2019"]
[null,{"$f":"IF(szablon_moment_bazowy!$H$12=\"Styczeń_2020\",miesiące_2!D72,C72)","v":"2019-04-11"},"2019-05-09","2019-04-11",null,"09.05.2019"]
[null,{"$f":"IF(szablon_moment_bazowy!$H$12=\"Styczeń_2020\",miesiące_2!D73,C73)","v":"2019-04-12"},"2019-05-10","2019-04-12",null,"10.05.2019"]
[null,{"$f":"IF(szablon_moment_bazowy!$H$12=\"Styczeń_2020\",miesiące_2!D74,C74)","v":"2019-04-13"},"2019-05-11","2019-04-13",null,"11.05.2019"]
[null,{"$f":"IF(szablon_moment_bazowy!$H$12=\"Styczeń_2020\",miesiące_2!D75,C75)","v":"2019-04-14"},"2019-05-12","2019-04-14",null,"12.05.2019"]
[null,{"$f":"IF(szablon_moment_bazowy!$H$12=\"Styczeń_2020\",miesiące_2!D76,C76)","v":"2019-04-15"},"2019-05-13","2019-04-15",null,"13.05.2019"]
[null,{"$f":"IF(szablon_moment_bazowy!$H$12=\"Styczeń_2020\",miesiące_2!D77,C77)","v":"2019-04-16"},"2019-05-14","2019-04-16",null,"14.05.2019"]
[null,{"$f":"IF(szablon_moment_bazowy!$H$12=\"Styczeń_2020\",miesiące_2!D78,C78)","v":"2019-04-17"},"2019-05-15","2019-04-17",null,"15.05.2019"]
[null,{"$f":"IF(szablon_moment_bazowy!$H$12=\"Styczeń_2020\",miesiące_2!D79,C79)","v":"2019-04-18"},"2019-05-16","2019-04-18",null,"16.05.2019"]
[null,{"$f":"IF(szablon_moment_bazowy!$H$12=\"Styczeń_2020\",miesiące_2!D80,C80)","v":"2019-04-19"},"2019-05-17","2019-04-19",null,"17.05.2019"]
[null,{"$f":"IF(szablon_moment_bazowy!$H$12=\"Styczeń_2020\",miesiące_2!D81,C81)","v":"2019-04-20"},"2019-05-18","2019-04-20",null,"18.05.2019"]
[null,{"$f":"IF(szablon_moment_bazowy!$H$12=\"Styczeń_2020\",miesiące_2!D82,C82)","v":"2019-04-21"},"2019-05-19","2019-04-21",null,"19.05.2019"]
[null,{"$f":"IF(szablon_moment_bazowy!$H$12=\"Styczeń_2020\",miesiące_2!D83,C83)","v":"2019-04-22"},"2019-05-20","2019-04-22",null,"20.05.2019"]
[null,{"$f":"IF(szablon_moment_bazowy!$H$12=\"Styczeń_2020\",miesiące_2!D84,C84)","v":"2019-04-23"},"2019-05-21","2019-04-23",null,"21.05.2019"]
[null,{"$f":"IF(szablon_moment_bazowy!$H$12=\"Styczeń_2020\",miesiące_2!D85,C85)","v":"2019-04-24"},"2019-05-22","2019-04-24",null,"22.05.2019"]
[null,{"$f":"IF(szablon_moment_bazowy!$H$12=\"Styczeń_2020\",miesiące_2!D86,C86)","v":"2019-04-25"},"2019-05-23","2019-04-25",null,"23.05.2019"]
[null,{"$f":"IF(szablon_moment_bazowy!$H$12=\"Styczeń_2020\",miesiące_2!D87,C87)","v":"2019-04-26"},"2019-05-24","2019-04-26",null,"24.05.2019"]
[null,{"$f":"IF(szablon_moment_bazowy!$H$12=\"Styczeń_2020\",miesiące_2!D88,C88)","v":"2019-04-27"},"2019-05-25","2019-04-27",null,"25.05.2019"]
[null,{"$f":"IF(szablon_moment_bazowy!$H$12=\"Styczeń_2020\",miesiące_2!D89,C89)","v":"2019-04-28"},"2019-05-26","2019-04-28",null,"26.05.2019"]
[null,{"$f":"IF(szablon_moment_bazowy!$H$12=\"Styczeń_2020\",miesiące_2!D90,C90)","v":"2019-04-29"},"2019-05-27","2019-04-29",null,"27.05.2019"]
[null,{"$f":"IF(szablon_moment_bazowy!$H$12=\"Styczeń_2020\",miesiące_2!D91,C91)","v":"2019-04-30"},"2019-05-28","2019-04-30",null,"28.05.2019"]
[null,{"$f":"IF(szablon_moment_bazowy!$H$12=\"Styczeń_2020\",miesiące_2!D92,C92)","v":"2019-05-01"},"2019-05-29","2019-05-01",null,"29.05.2019"]
[null,{"$f":"IF(szablon_moment_bazowy!$H$12=\"Styczeń_2020\",miesiące_2!D93,C93)","v":"2019-05-02"},"2019-05-30","2019-05-02",null,"30.05.2019"]
[null,{"$f":"IF(szablon_moment_bazowy!$H$12=\"Styczeń_2020\",miesiące_2!D94,C94)","v":"2019-05-03"},"2019-05-31","2019-05-03",null,"31.05.2019"]
[null,{"$f":"IF(szablon_moment_bazowy!$H$12=\"Styczeń_2020\",miesiące_2!D95,C95)","v":"2019-05-04"},"2019-06-01","2019-05-04",null,"01.06.2019"]
[null,{"$f":"IF(szablon_moment_bazowy!$H$12=\"Styczeń_2020\",miesiące_2!D96,C96)","v":"2019-05-05"},"2019-06-02","2019-05-05",null,"02.06.2019"]
[null,{"$f":"IF(szablon_moment_bazowy!$H$12=\"Styczeń_2020\",miesiące_2!D97,C97)","v":"2019-05-06"},"2019-06-03","2019-05-06",null,"03.06.2019"]
[null,{"$f":"IF(szablon_moment_bazowy!$H$12=\"Styczeń_2020\",miesiące_2!D98,C98)","v":"2019-05-07"},"2019-06-04","2019-05-07",null,"04.06.2019"]
[null,{"$f":"IF(szablon_moment_bazowy!$H$12=\"Styczeń_2020\",miesiące_2!D99,C99)","v":"2019-05-08"},"2019-06-05","2019-05-08",null,"05.06.2019"]
[null,{"$f":"IF(szablon_moment_bazowy!$H$12=\"Styczeń_2020\",miesiące_2!D100,C100)","v":"2019-05-09"},"2019-06-06","2019-05-09",null,"06.06.2019"]
[null,{"$f":"IF(szablon_moment_bazowy!$H$12=\"Styczeń_2020\",miesiące_2!D101,C101)","v":"2019-05-10"},"2019-06-07","2019-05-10",null,"07.06.2019"]
[null,{"$f":"IF(szablon_moment_bazowy!$H$12=\"Styczeń_2020\",miesiące_2!D102,C102)","v":"2019-05-11"},"2019-06-08","2019-05-11",null,"08.06.2019"]
[null,{"$f":"IF(szablon_moment_bazowy!$H$12=\"Styczeń_2020\",miesiące_2!D103,C103)","v":"2019-05-12"},"2019-06-09","2019-05-12",null,"09.06.2019"]
[null,{"$f":"IF(szablon_moment_bazowy!$H$12=\"Styczeń_2020\",miesiące_2!D104,C104)","v":"2019-05-13"},"2019-06-10","2019-05-13",null,"10.06.2019"]
[null,{"$f":"IF(szablon_moment_bazowy!$H$12=\"Styczeń_2020\",miesiące_2!D105,C105)","v":"2019-05-14"},"2019-06-11","2019-05-14",null,"11.06.2019"]
[null,{"$f":"IF(szablon_moment_bazowy!$H$12=\"Styczeń_2020\",miesiące_2!D106,C106)","v":"2019-05-15"},"2019-06-12","2019-05-15",null,"12.06.2019"]
[null,{"$f":"IF(szablon_moment_bazowy!$H$12=\"Styczeń_2020\",miesiące_2!D107,C107)","v":"2019-05-16"},"2019-06-13","2019-05-16",null,"13.06.2019"]
[null,{"$f":"IF(szablon_moment_bazowy!$H$12=\"Styczeń_2020\",miesiące_2!D108,C108)","v":"2019-05-17"},"2019-06-14","2019-05-17",null,"14.06.2019"]
[null,{"$f":"IF(szablon_moment_bazowy!$H$12=\"Styczeń_2020\",miesiące_2!D109,C109)","v":"2019-05-18"},"2019-06-15","2019-05-18",null,"15.06.2019"]
[null,{"$f":"IF(szablon_moment_bazowy!$H$12=\"Styczeń_2020\",miesiące_2!D110,C110)","v":"2019-05-19"},"2019-06-16","2019-05-19",null,"16.06.2019"]
[null,{"$f":"IF(szablon_moment_bazowy!$H$12=\"Styczeń_2020\",miesiące_2!D111,C111)","v":"2019-05-20"},"2019-06-17","2019-05-20",null,"17.06.2019"]
[null,{"$f":"IF(szablon_moment_bazowy!$H$12=\"Styczeń_2020\",miesiące_2!D112,C112)","v":"2019-05-21"},"2019-06-18","2019-05-21",null,"18.06.2019"]
[null,{"$f":"IF(szablon_moment_bazowy!$H$12=\"Styczeń_2020\",miesiące_2!D113,C113)","v":"2019-05-22"},"2019-06-19","2019-05-22",null,"19.06.2019"]
[null,{"$f":"IF(szablon_moment_bazowy!$H$12=\"Styczeń_2020\",miesiące_2!D114,C114)","v":"2019-05-23"},"2019-06-20","2019-05-23",null,"20.06.2019"]
[null,{"$f":"IF(szablon_moment_bazowy!$H$12=\"Styczeń_2020\",miesiące_2!D115,C115)","v":"2019-05-24"},"2019-06-21","2019-05-24",null,"21.06.2019"]
[null,{"$f":"IF(szablon_moment_bazowy!$H$12=\"Styczeń_2020\",miesiące_2!D116,C116)","v":"2019-05-25"},"2019-06-22","2019-05-25",null,"22.06.2019"]
[null,{"$f":"IF(szablon_moment_bazowy!$H$12=\"Styczeń_2020\",miesiące_2!D117,C117)","v":"2019-05-26"},"2019-06-23","2019-05-26",null,"23.06.2019"]
[null,{"$f":"IF(szablon_moment_bazowy!$H$12=\"Styczeń_2020\",miesiące_2!D118,C118)","v":"2019-05-27"},"2019-06-24","2019-05-27",null,"24.06.2019"]
[null,{"$f":"IF(szablon_moment_bazowy!$H$12=\"Styczeń_2020\",miesiące_2!D119,C119)","v":"2019-05-28"},"2019-06-25","2019-05-28",null,"25.06.2019"]
[null,{"$f":"IF(szablon_moment_bazowy!$H$12=\"Styczeń_2020\",miesiące_2!D120,C120)","v":"2019-05-29"},"2019-06-26","2019-05-29",null,"26.06.2019"]
[null,{"$f":"IF(szablon_moment_bazowy!$H$12=\"Styczeń_2020\",miesiące_2!D121,C121)","v":"2019-05-30"},"2019-06-27","2019-05-30",null,"27.06.2019"]
[null,{"$f":"IF(szablon_moment_bazowy!$H$12=\"Styczeń_2020\",miesiące_2!D122,C122)","v":"2019-05-31"},"2019-06-28","2019-05-31",null,"28.06.2019"]
[null,{"$f":"IF(szablon_moment_bazowy!$H$12=\"Styczeń_2020\",miesiące_2!D123,C123)","v":"2019-06-01"},"2019-06-29","2019-06-01",null,"29.06.2019"]
[null,{"$f":"IF(szablon_moment_bazowy!$H$12=\"Styczeń_2020\",miesiące_2!D124,C124)","v":"2019-06-02"},"2019-06-30","2019-06-02",null,"30.06.2019"]
[null,{"$f":"IF(szablon_moment_bazowy!$H$12=\"Styczeń_2020\",miesiące_2!D125,C125)","v":"2019-06-03"},"2019-07-01","2019-06-03",null,"01.07.2019"]
[null,{"$f":"IF(szablon_moment_bazowy!$H$12=\"Styczeń_2020\",miesiące_2!D126,C126)","v":"2019-06-04"},"2019-07-02","2019-06-04",null,"02.07.2019"]
[null,{"$f":"IF(szablon_moment_bazowy!$H$12=\"Styczeń_2020\",miesiące_2!D127,C127)","v":"2019-06-05"},"2019-07-03","2019-06-05",null,"03.07.2019"]
[null,{"$f":"IF(szablon_moment_bazowy!$H$12=\"Styczeń_2020\",miesiące_2!D128,C128)","v":"2019-06-06"},"2019-07-04","2019-06-06",null,"04.07.2019"]
[null,{"$f":"IF(szablon_moment_bazowy!$H$12=\"Styczeń_2020\",miesiące_2!D129,C129)","v":"2019-06-07"},"2019-07-05","2019-06-07",null,"05.07.2019"]
[null,{"$f":"IF(szablon_moment_bazowy!$H$12=\"Styczeń_2020\",miesiące_2!D130,C130)","v":"2019-06-08"},"2019-07-06","2019-06-08",null,"06.07.2019"]
[null,{"$f":"IF(szablon_moment_bazowy!$H$12=\"Styczeń_2020\",miesiące_2!D131,C131)","v":"2019-06-09"},"2019-07-07","2019-06-09",null,"07.07.2019"]
[null,{"$f":"IF(szablon_moment_bazowy!$H$12=\"Styczeń_2020\",miesiące_2!D132,C132)","v":"2019-06-10"},"2019-07-08","2019-06-10",null,{"$f":"TEXT(C132,\"dd.mm.rrrrr\")","v":"08.07.2019"}]
[null,{"$f":"IF(szablon_moment_bazowy!$H$12=\"Styczeń_2020\",miesiące_2!D133,C133)","v":"2019-06-11"},"2019-07-09","2019-06-11",null,"09.07.2019"]
[null,{"$f":"IF(szablon_moment_bazowy!$H$12=\"Styczeń_2020\",miesiące_2!D134,C134)","v":"2019-06-12"},"2019-07-10","2019-06-12",null,"10.07.2019"]
[null,{"$f":"IF(szablon_moment_bazowy!$H$12=\"Styczeń_2020\",miesiące_2!D135,C135)","v":"2019-06-13"},"2019-07-11","2019-06-13",null,"11.07.2019"]
[null,{"$f":"IF(szablon_moment_bazowy!$H$12=\"Styczeń_2020\",miesiące_2!D136,C136)","v":"2019-06-14"},"2019-07-12","2019-06-14",null,"12.07.2019"]
[null,{"$f":"IF(szablon_moment_bazowy!$H$12=\"Styczeń_2020\",miesiące_2!D137,C137)","v":"2019-06-15"},"2019-07-13","2019-06-15",null,"13.07.2019"]
[null,{"$f":"IF(szablon_moment_bazowy!$H$12=\"Styczeń_2020\",miesiące_2!D138,C138)","v":"2019-06-16"},"2019-07-14","2019-06-16",null,"14.07.2019"]
[null,{"$f":"IF(szablon_moment_bazowy!$H$12=\"Styczeń_2020\",miesiące_2!D139,C139)","v":"2019-06-17"},"2019-07-15","2019-06-17",null,"15.07.2019"]
[null,{"$f":"IF(szablon_moment_bazowy!$H$12=\"Styczeń_2020\",miesiące_2!D140,C140)","v":"2019-06-18"},"2019-07-16","2019-06-18",null,"16.07.2019"]
[null,{"$f":"IF(szablon_moment_bazowy!$H$12=\"Styczeń_2020\",miesiące_2!D141,C141)","v":"2019-06-19"},"2019-07-17","2019-06-19",null,"17.07.2019"]
[null,{"$f":"IF(szablon_moment_bazowy!$H$12=\"Styczeń_2020\",miesiące_2!D142,C142)","v":"2019-06-20"},"2019-07-18","2019-06-20",null,"18.07.2019"]
[null,{"$f":"IF(szablon_moment_bazowy!$H$12=\"Styczeń_2020\",miesiące_2!D143,C143)","v":"2019-06-21"},"2019-07-19","2019-06-21",null,"19.07.2019"]
[null,{"$f":"IF(szablon_moment_bazowy!$H$12=\"Styczeń_2020\",miesiące_2!D144,C144)","v":"2019-06-22"},"2019-07-20","2019-06-22",null,"20.07.2019"]
[null,{"$f":"IF(szablon_moment_bazowy!$H$12=\"Styczeń_2020\",miesiące_2!D145,C145)","v":"2019-06-23"},"2019-07-21","2019-06-23",null,"21.07.2019"]
[null,{"$f":"IF(szablon_moment_bazowy!$H$12=\"Styczeń_2020\",miesiące_2!D146,C146)","v":"2019-06-24"},"2019-07-22","2019-06-24",null,"22.07.2019"]
[null,{"$f":"IF(szablon_moment_bazowy!$H$12=\"Styczeń_2020\",miesiące_2!D147,C147)","v":"2019-06-25"},"2019-07-23","2019-06-25",null,"23.07.2019"]
[null,{"$f":"IF(szablon_moment_bazowy!$H$12=\"Styczeń_2020\",miesiące_2!D148,C148)","v":"2019-06-26"},"2019-07-24","2019-06-26",null,"24.07.2019"]
[null,{"$f":"IF(szablon_moment_bazowy!$H$12=\"Styczeń_2020\",miesiące_2!D149,C149)","v":"2019-06-27"},"2019-07-25","2019-06-27",null,"25.07.2019"]
[null,{"$f":"IF(szablon_moment_bazowy!$H$12=\"Styczeń_2020\",miesiące_2!D150,C150)","v":"2019-06-28"},"2019-07-26","2019-06-28",null,"26.07.2019"]
[null,{"$f":"IF(szablon_moment_bazowy!$H$12=\"Styczeń_2020\",miesiące_2!D151,C151)","v":"2019-06-29"},"2019-07-27","2019-06-29",null,"27.07.2019"]
[null,{"$f":"IF(szablon_moment_bazowy!$H$12=\"Styczeń_2020\",miesiące_2!D152,C152)","v":"2019-06-30"},"2019-07-28","2019-06-30",null,"28.07.2019"]
[null,{"$f":"IF(szablon_moment_bazowy!$H$12=\"Styczeń_2020\",miesiące_2!D153,C153)","v":"2019-07-01"},"2019-07-29","2019-07-01",null,"29.07.2019"]
[null,{"$f":"IF(szablon_moment_bazowy!$H$12=\"Styczeń_2020\",miesiące_2!D154,C154)","v":"2019-07-02"},"2019-07-30","2019-07-02",null,"30.07.2019"]
[null,{"$f":"IF(szablon_moment_bazowy!$H$12=\"Styczeń_2020\",miesiące_2!D155,C155)","v":"2019-07-03"},"2019-07-31","2019-07-03",null,"31.07.2019"]
[null,{"$f":"IF(szablon_moment_bazowy!$H$12=\"Styczeń_2020\",miesiące_2!D156,C156)","v":"2019-07-04"},"2019-08-01","2019-07-04",null,"01.08.2019"]
[null,{"$f":"IF(szablon_moment_bazowy!$H$12=\"Styczeń_2020\",miesiące_2!D157,C157)","v":"2019-07-05"},"2019-08-02","2019-07-05",null,"02.08.2019"]
[null,{"$f":"IF(szablon_moment_bazowy!$H$12=\"Styczeń_2020\",miesiące_2!D158,C158)","v":"2019-07-06"},"2019-08-03","2019-07-06",null,"03.08.2019"]
[null,{"$f":"IF(szablon_moment_bazowy!$H$12=\"Styczeń_2020\",miesiące_2!D159,C159)","v":"2019-07-07"},"2019-08-04","2019-07-07",null,"04.08.2019"]
[null,{"$f":"IF(szablon_moment_bazowy!$H$12=\"Styczeń_2020\",miesiące_2!D160,C160)","v":"2019-07-08"},"2019-08-05","2019-07-08",null,"05.08.2019"]
[null,{"$f":"IF(szablon_moment_bazowy!$H$12=\"Styczeń_2020\",miesiące_2!D161,C161)","v":"2019-07-09"},"2019-08-06","2019-07-09",null,"06.08.2019"]
[null,{"$f":"IF(szablon_moment_bazowy!$H$12=\"Styczeń_2020\",miesiące_2!D162,C162)","v":"2019-07-10"},"2019-08-07","2019-07-10",null,"07.08.2019"]
[null,{"$f":"IF(szablon_moment_bazowy!$H$12=\"Styczeń_2020\",miesiące_2!D163,C163)","v":"2019-07-11"},"2019-08-08","2019-07-11",null,"08.08.2019"]
[null,{"$f":"IF(szablon_moment_bazowy!$H$12=\"Styczeń_2020\",miesiące_2!D164,C164)","v":"2019-07-12"},"2019-08-09","2019-07-12",null,"09.08.2019"]
[null,{"$f":"IF(szablon_moment_bazowy!$H$12=\"Styczeń_2020\",miesiące_2!D165,C165)","v":"2019-07-13"},"2019-08-10","2019-07-13",null,"10.08.2019"]
[null,{"$f":"IF(szablon_moment_bazowy!$H$12=\"Styczeń_2020\",miesiące_2!D166,C166)","v":"2019-07-14"},"2019-08-11","2019-07-14",null,"11.08.2019"]
[null,{"$f":"IF(szablon_moment_bazowy!$H$12=\"Styczeń_2020\",miesiące_2!D167,C167)","v":"2019-07-15"},"2019-08-12","2019-07-15",null,"12.08.2019"]
[null,{"$f":"IF(szablon_moment_bazowy!$H$12=\"Styczeń_2020\",miesiące_2!D168,C168)","v":"2019-07-16"},"2019-08-13","2019-07-16",null,"13.08.2019"]
[null,{"$f":"IF(szablon_moment_bazowy!$H$12=\"Styczeń_2020\",miesiące_2!D169,C169)","v":"2019-07-17"},"2019-08-14","2019-07-17",null,"14.08.2019"]
[null,{"$f":"IF(szablon_moment_bazowy!$H$12=\"Styczeń_2020\",miesiące_2!D170,C170)","v":"2019-07-18"},"2019-08-15","2019-07-18",null,"15.08.2019"]
[null,{"$f":"IF(szablon_moment_bazowy!$H$12=\"Styczeń_2020\",miesiące_2!D171,C171)","v":"2019-07-19"},"2019-08-16","2019-07-19",null,"16.08.2019"]
[null,{"$f":"IF(szablon_moment_bazowy!$H$12=\"Styczeń_2020\",miesiące_2!D172,C172)","v":"2019-07-20"},"2019-08-17","2019-07-20",null,"17.08.2019"]
[null,{"$f":"IF(szablon_moment_bazowy!$H$12=\"Styczeń_2020\",miesiące_2!D173,C173)","v":"2019-07-21"},"2019-08-18","2019-07-21",null,"18.08.2019"]
[null,{"$f":"IF(szablon_moment_bazowy!$H$12=\"Styczeń_2020\",miesiące_2!D174,C174)","v":"2019-07-22"},"2019-08-19","2019-07-22",null,"19.08.2019"]
[null,{"$f":"IF(szablon_moment_bazowy!$H$12=\"Styczeń_2020\",miesiące_2!D175,C175)","v":"2019-07-23"},"2019-08-20","2019-07-23",null,"20.08.2019"]
[null,{"$f":"IF(szablon_moment_bazowy!$H$12=\"Styczeń_2020\",miesiące_2!D176,C176)","v":"2019-07-24"},"2019-08-21","2019-07-24",null,"21.08.2019"]
[null,{"$f":"IF(szablon_moment_bazowy!$H$12=\"Styczeń_2020\",miesiące_2!D177,C177)","v":"2019-07-25"},"2019-08-22","2019-07-25",null,"22.08.2019"]
[null,{"$f":"IF(szablon_moment_bazowy!$H$12=\"Styczeń_2020\",miesiące_2!D178,C178)","v":"2019-07-26"},"2019-08-23","2019-07-26",null,"23.08.2019"]
[null,{"$f":"IF(szablon_moment_bazowy!$H$12=\"Styczeń_2020\",miesiące_2!D179,C179)","v":"2019-07-27"},"2019-08-24","2019-07-27",null,"24.08.2019"]
[null,{"$f":"IF(szablon_moment_bazowy!$H$12=\"Styczeń_2020\",miesiące_2!D180,C180)","v":"2019-07-28"},"2019-08-25","2019-07-28",null,"25.08.2019"]
[null,{"$f":"IF(szablon_moment_bazowy!$H$12=\"Styczeń_2020\",miesiące_2!D181,C181)","v":"2019-07-29"},"2019-08-26","2019-07-29",null,"26.08.2019"]
[null,{"$f":"IF(szablon_moment_bazowy!$H$12=\"Styczeń_2020\",miesiące_2!D182,C182)","v":"2019-07-30"},"2019-08-27","2019-07-30",null,"27.08.2019"]
[null,{"$f":"IF(szablon_moment_bazowy!$H$12=\"Styczeń_2020\",miesiące_2!D183,C183)","v":"2019-07-31"},"2019-08-28","2019-07-31",null,"28.08.2019"]
[null,{"$f":"IF(szablon_moment_bazowy!$H$12=\"Styczeń_2020\",miesiące_2!D184,C184)","v":"2019-08-01"},"2019-08-29","2019-08-01",null,"29.08.2019"]
[null,{"$f":"IF(szablon_moment_bazowy!$H$12=\"Styczeń_2020\",miesiące_2!D185,C185)","v":"2019-08-02"},"2019-08-30","2019-08-02",null,"30.08.2019"]
[null,{"$f":"IF(szablon_moment_bazowy!$H$12=\"Styczeń_2020\",miesiące_2!D186,C186)","v":"2019-08-03"},"2019-08-31","2019-08-03",null,"31.08.2019"]
[null,{"$f":"IF(szablon_moment_bazowy!$H$12=\"Styczeń_2020\",miesiące_2!D187,C187)","v":"2019-08-04"},"2019-09-01","2019-08-04",null,"01.09.2019"]
[null,{"$f":"IF(szablon_moment_bazowy!$H$12=\"Styczeń_2020\",miesiące_2!D188,C188)","v":"2019-08-05"},"2019-09-02","2019-08-05",null,"02.09.2019"]
[null,{"$f":"IF(szablon_moment_bazowy!$H$12=\"Styczeń_2020\",miesiące_2!D189,C189)","v":"2019-08-06"},"2019-09-03","2019-08-06",null,"03.09.2019"]
[null,{"$f":"IF(szablon_moment_bazowy!$H$12=\"Styczeń_2020\",miesiące_2!D190,C190)","v":"2019-08-07"},"2019-09-04","2019-08-07",null,"04.09.2019"]
[null,{"$f":"IF(szablon_moment_bazowy!$H$12=\"Styczeń_2020\",miesiące_2!D191,C191)","v":"2019-08-08"},"2019-09-05","2019-08-08",null,"05.09.2019"]
[null,{"$f":"IF(szablon_moment_bazowy!$H$12=\"Styczeń_2020\",miesiące_2!D192,C192)","v":"2019-08-09"},"2019-09-06","2019-08-09",null,"06.09.2019"]
[null,{"$f":"IF(szablon_moment_bazowy!$H$12=\"Styczeń_2020\",miesiące_2!D193,C193)","v":"2019-08-10"},"2019-09-07","2019-08-10",null,"07.09.2019"]
[null,{"$f":"IF(szablon_moment_bazowy!$H$12=\"Styczeń_2020\",miesiące_2!D194,C194)","v":"2019-08-11"},"2019-09-08","2019-08-11",null,"08.09.2019"]
[null,{"$f":"IF(szablon_moment_bazowy!$H$12=\"Styczeń_2020\",miesiące_2!D195,C195)","v":"2019-08-12"},"2019-09-09","2019-08-12",null,"09.09.2019"]
[null,{"$f":"IF(szablon_moment_bazowy!$H$12=\"Styczeń_2020\",miesiące_2!D196,C196)","v":"2019-08-13"},"2019-09-10","2019-08-13",null,{"$f":"TEXT(C196,\"dd.mm.rrrrr\")","v":"10.09.2019"}]
[null,{"$f":"IF(szablon_moment_bazowy!$H$12=\"Styczeń_2020\",miesiące_2!D197,C197)","v":"2019-08-14"},"2019-09-11","2019-08-14",null,"11.09.2019"]
[null,{"$f":"IF(szablon_moment_bazowy!$H$12=\"Styczeń_2020\",miesiące_2!D198,C198)","v":"2019-08-15"},"2019-09-12","2019-08-15",null,"12.09.2019"]
[null,{"$f":"IF(szablon_moment_bazowy!$H$12=\"Styczeń_2020\",miesiące_2!D199,C199)","v":"2019-08-16"},"2019-09-13","2019-08-16",null,"13.09.2019"]
[null,{"$f":"IF(szablon_moment_bazowy!$H$12=\"Styczeń_2020\",miesiące_2!D200,C200)","v":"2019-08-17"},"2019-09-14","2019-08-17",null,"14.09.2019"]
[null,{"$f":"IF(szablon_moment_bazowy!$H$12=\"Styczeń_2020\",miesiące_2!D201,C201)","v":"2019-08-18"},"2019-09-15","2019-08-18",null,"15.09.2019"]
[null,{"$f":"IF(szablon_moment_bazowy!$H$12=\"Styczeń_2020\",miesiące_2!D202,C202)","v":"2019-08-19"},"2019-09-16","2019-08-19",null,"16.09.2019"]
[null,{"$f":"IF(szablon_moment_bazowy!$H$12=\"Styczeń_2020\",miesiące_2!D203,C203)","v":"2019-08-20"},"2019-09-17","2019-08-20",null,"17.09.2019"]
[null,{"$f":"IF(szablon_moment_bazowy!$H$12=\"Styczeń_2020\",miesiące_2!D204,C204)","v":"2019-08-21"},"2019-09-18","2019-08-21",null,"18.09.2019"]
[null,{"$f":"IF(szablon_moment_bazowy!$H$12=\"Styczeń_2020\",miesiące_2!D205,C205)","v":"2019-08-22"},"2019-09-19","2019-08-22",null,"19.09.2019"]
[null,{"$f":"IF(szablon_moment_bazowy!$H$12=\"Styczeń_2020\",miesiące_2!D206,C206)","v":"2019-08-23"},"2019-09-20","2019-08-23",null,"20.09.2019"]
[null,{"$f":"IF(szablon_moment_bazowy!$H$12=\"Styczeń_2020\",miesiące_2!D207,C207)","v":"2019-08-24"},"2019-09-21","2019-08-24",null,"21.09.2019"]
[null,{"$f":"IF(szablon_moment_bazowy!$H$12=\"Styczeń_2020\",miesiące_2!D208,C208)","v":"2019-08-25"},"2019-09-22","2019-08-25",null,"22.09.2019"]
[null,{"$f":"IF(szablon_moment_bazowy!$H$12=\"Styczeń_2020\",miesiące_2!D209,C209)","v":"2019-08-26"},"2019-09-23","2019-08-26",null,"23.09.2019"]
[null,{"$f":"IF(szablon_moment_bazowy!$H$12=\"Styczeń_2020\",miesiące_2!D210,C210)","v":"2019-08-27"},"2019-09-24","2019-08-27",null,"24.09.2019"]
[null,{"$f":"IF(szablon_moment_bazowy!$H$12=\"Styczeń_2020\",miesiące_2!D211,C211)","v":"2019-08-28"},"2019-09-25","2019-08-28",null,"25.09.2019"]
[null,{"$f":"IF(szablon_moment_bazowy!$H$12=\"Styczeń_2020\",miesiące_2!D212,C212)","v":"2019-08-29"},"2019-09-26","2019-08-29",null,"26.09.2019"]
[null,{"$f":"IF(szablon_moment_bazowy!$H$12=\"Styczeń_2020\",miesiące_2!D213,C213)","v":"2019-08-30"},"2019-09-27","2019-08-30",null,"27.09.2019"]
[null,{"$f":"IF(szablon_moment_bazowy!$H$12=\"Styczeń_2020\",miesiące_2!D214,C214)","v":"2019-08-31"},"2019-09-28","2019-08-31",null,"28.09.2019"]
[null,{"$f":"IF(szablon_moment_bazowy!$H$12=\"Styczeń_2020\",miesiące_2!D215,C215)","v":"2019-09-01"},"2019-09-29","2019-09-01",null,"29.09.2019"]
[null,{"$f":"IF(szablon_moment_bazowy!$H$12=\"Styczeń_2020\",miesiące_2!D216,C216)","v":"2019-09-02"},"2019-09-30","2019-09-02",null,"30.09.2019"]
[null,{"$f":"IF(szablon_moment_bazowy!$H$12=\"Styczeń_2020\",miesiące_2!D217,C217)","v":"2019-09-03"},"2019-10-01","2019-09-03",null,"01.10.2019"]
[null,{"$f":"IF(szablon_moment_bazowy!$H$12=\"Styczeń_2020\",miesiące_2!D218,C218)","v":"2019-09-04"},"2019-10-02","2019-09-04",null,"02.10.2019"]
[null,{"$f":"IF(szablon_moment_bazowy!$H$12=\"Styczeń_2020\",miesiące_2!D219,C219)","v":"2019-09-05"},"2019-10-03","2019-09-05",null,"03.10.2019"]
[null,{"$f":"IF(szablon_moment_bazowy!$H$12=\"Styczeń_2020\",miesiące_2!D220,C220)","v":"2019-09-06"},"2019-10-04","2019-09-06",null,"04.10.2019"]
[null,{"$f":"IF(szablon_moment_bazowy!$H$12=\"Styczeń_2020\",miesiące_2!D221,C221)","v":"2019-09-07"},"2019-10-05","2019-09-07",null,"05.10.2019"]
[null,{"$f":"IF(szablon_moment_bazowy!$H$12=\"Styczeń_2020\",miesiące_2!D222,C222)","v":"2019-09-08"},"2019-10-06","2019-09-08",null,"06.10.2019"]
[null,{"$f":"IF(szablon_moment_bazowy!$H$12=\"Styczeń_2020\",miesiące_2!D223,C223)","v":"2019-09-09"},"2019-10-07","2019-09-09",null,"07.10.2019"]
[null,{"$f":"IF(szablon_moment_bazowy!$H$12=\"Styczeń_2020\",miesiące_2!D224,C224)","v":"2019-09-10"},"2019-10-08","2019-09-10",null,"08.10.2019"]
[null,{"$f":"IF(szablon_moment_bazowy!$H$12=\"Styczeń_2020\",miesiące_2!D225,C225)","v":"2019-09-11"},"2019-10-09","2019-09-11",null,"09.10.2019"]
[null,{"$f":"IF(szablon_moment_bazowy!$H$12=\"Styczeń_2020\",miesiące_2!D226,C226)","v":"2019-09-12"},"2019-10-10","2019-09-12",null,"10.10.2019"]
[null,{"$f":"IF(szablon_moment_bazowy!$H$12=\"Styczeń_2020\",miesiące_2!D227,C227)","v":"2019-09-13"},"2019-10-11","2019-09-13",null,"11.10.2019"]
[null,{"$f":"IF(szablon_moment_bazowy!$H$12=\"Styczeń_2020\",miesiące_2!D228,C228)","v":"2019-09-14"},"2019-10-12","2019-09-14",null,"12.10.2019"]
[null,{"$f":"IF(szablon_moment_bazowy!$H$12=\"Styczeń_2020\",miesiące_2!D229,C229)","v":"2019-09-15"},"2019-10-13","2019-09-15",null,"13.10.2019"]
[null,{"$f":"IF(szablon_moment_bazowy!$H$12=\"Styczeń_2020\",miesiące_2!D230,C230)","v":"2019-09-16"},"2019-10-14","2019-09-16",null,"14.10.2019"]
[null,{"$f":"IF(szablon_moment_bazowy!$H$12=\"Styczeń_2020\",miesiące_2!D231,C231)","v":"2019-09-17"},"2019-10-15","2019-09-17",null,"15.10.2019"]
[null,{"$f":"IF(szablon_moment_bazowy!$H$12=\"Styczeń_2020\",miesiące_2!D232,C232)","v":"2019-09-18"},"2019-10-16","2019-09-18",null,"16.10.2019"]
[null,{"$f":"IF(szablon_moment_bazowy!$H$12=\"Styczeń_2020\",miesiące_2!D233,C233)","v":"2019-09-19"},"2019-10-17","2019-09-19",null,"17.10.2019"]
[null,{"$f":"IF(szablon_moment_bazowy!$H$12=\"Styczeń_2020\",miesiące_2!D234,C234)","v":"2019-09-20"},"2019-10-18","2019-09-20",null,"18.10.2019"]
[null,{"$f":"IF(szablon_moment_bazowy!$H$12=\"Styczeń_2020\",miesiące_2!D235,C235)","v":"2019-09-21"},"2019-10-19","2019-09-21",null,"19.10.2019"]
[null,{"$f":"IF(szablon_moment_bazowy!$H$12=\"Styczeń_2020\",miesiące_2!D236,C236)","v":"2019-09-22"},"2019-10-20","2019-09-22",null,"20.10.2019"]
[null,{"$f":"IF(szablon_moment_bazowy!$H$12=\"Styczeń_2020\",miesiące_2!D237,C237)","v":"2019-09-23"},"2019-10-21","2019-09-23",null,"21.10.2019"]
[null,{"$f":"IF(szablon_moment_bazowy!$H$12=\"Styczeń_2020\",miesiące_2!D238,C238)","v":"2019-09-24"},"2019-10-22","2019-09-24",null,"22.10.2019"]
[null,{"$f":"IF(szablon_moment_bazowy!$H$12=\"Styczeń_2020\",miesiące_2!D239,C239)","v":"2019-09-25"},"2019-10-23","2019-09-25",null,"23.10.2019"]
[null,{"$f":"IF(szablon_moment_bazowy!$H$12=\"Styczeń_2020\",miesiące_2!D240,C240)","v":"2019-09-26"},"2019-10-24","2019-09-26",null,"24.10.2019"]
[null,{"$f":"IF(szablon_moment_bazowy!$H$12=\"Styczeń_2020\",miesiące_2!D241,C241)","v":"2019-09-27"},"2019-10-25","2019-09-27",null,"25.10.2019"]
[null,{"$f":"IF(szablon_moment_bazowy!$H$12=\"Styczeń_2020\",miesiące_2!D242,C242)","v":"2019-09-28"},"2019-10-26","2019-09-28",null,"26.10.2019"]
[null,{"$f":"IF(szablon_moment_bazowy!$H$12=\"Styczeń_2020\",miesiące_2!D243,C243)","v":"2019-09-29"},"2019-10-27","2019-09-29",null,"27.10.2019"]
[null,{"$f":"IF(szablon_moment_bazowy!$H$12=\"Styczeń_2020\",miesiące_2!D244,C244)","v":"2019-09-30"},"2019-10-28","2019-09-30",null,"28.10.2019"]
[null,{"$f":"IF(szablon_moment_bazowy!$H$12=\"Styczeń_2020\",miesiące_2!D245,C245)","v":"2019-10-01"},"2019-10-29","2019-10-01",null,"29.10.2019"]
[null,{"$f":"IF(szablon_moment_bazowy!$H$12=\"Styczeń_2020\",miesiące_2!D246,C246)","v":"2019-10-02"},"2019-10-30","2019-10-02",null,"30.10.2019"]
[null,{"$f":"IF(szablon_moment_bazowy!$H$12=\"Styczeń_2020\",miesiące_2!D247,C247)","v":"2019-10-03"},"2019-10-31","2019-10-03",null,"31.10.2019"]
[null,{"$f":"IF(szablon_moment_bazowy!$H$12=\"Styczeń_2020\",miesiące_2!D248,C248)","v":"2019-10-04"},"2019-11-01","2019-10-04",null,"01.11.2019"]
[null,{"$f":"IF(szablon_moment_bazowy!$H$12=\"Styczeń_2020\",miesiące_2!D249,C249)","v":"2019-10-05"},"2019-11-02","2019-10-05",null,"02.11.2019"]
[null,{"$f":"IF(szablon_moment_bazowy!$H$12=\"Styczeń_2020\",miesiące_2!D250,C250)","v":"2019-10-06"},"2019-11-03","2019-10-06",null,"03.11.2019"]
[null,{"$f":"IF(szablon_moment_bazowy!$H$12=\"Styczeń_2020\",miesiące_2!D251,C251)","v":"2019-10-07"},"2019-11-04","2019-10-07",null,"04.11.2019"]
[null,{"$f":"IF(szablon_moment_bazowy!$H$12=\"Styczeń_2020\",miesiące_2!D252,C252)","v":"2019-10-08"},"2019-11-05","2019-10-08",null,"05.11.2019"]
[null,{"$f":"IF(szablon_moment_bazowy!$H$12=\"Styczeń_2020\",miesiące_2!D253,C253)","v":"2019-10-09"},"2019-11-06","2019-10-09",null,"06.11.2019"]
[null,{"$f":"IF(szablon_moment_bazowy!$H$12=\"Styczeń_2020\",miesiące_2!D254,C254)","v":"2019-10-10"},"2019-11-07","2019-10-10",null,"07.11.2019"]
[null,{"$f":"IF(szablon_moment_bazowy!$H$12=\"Styczeń_2020\",miesiące_2!D255,C255)","v":"2019-10-11"},"2019-11-08","2019-10-11",null,"08.11.2019"]
[null,{"$f":"IF(szablon_moment_bazowy!$H$12=\"Styczeń_2020\",miesiące_2!D256,C256)","v":"2019-10-12"},"2019-11-09","2019-10-12",null,"09.11.2019"]
[null,{"$f":"IF(szablon_moment_bazowy!$H$12=\"Styczeń_2020\",miesiące_2!D257,C257)","v":"2019-10-13"},"2019-11-10","2019-10-13",null,"10.11.2019"]
[null,{"$f":"IF(szablon_moment_bazowy!$H$12=\"Styczeń_2020\",miesiące_2!D258,C258)","v":"2019-10-14"},"2019-11-11","2019-10-14",null,"11.11.2019"]
[null,{"$f":"IF(szablon_moment_bazowy!$H$12=\"Styczeń_2020\",miesiące_2!D259,C259)","v":"2019-10-15"},"2019-11-12","2019-10-15",null,"12.11.2019"]
[null,{"$f":"IF(szablon_moment_bazowy!$H$12=\"Styczeń_2020\",miesiące_2!D260,C260)","v":"2019-10-16"},"2019-11-13","2019-10-16",null,{"$f":"TEXT(C260,\"dd.mm.rrrrr\")","v":"13.11.2019"}]
[null,{"$f":"IF(szablon_moment_bazowy!$H$12=\"Styczeń_2020\",miesiące_2!D261,C261)","v":"2019-10-17"},"2019-11-14","2019-10-17",null,"14.11.2019"]
[null,{"$f":"IF(szablon_moment_bazowy!$H$12=\"Styczeń_2020\",miesiące_2!D262,C262)","v":"2019-10-18"},"2019-11-15","2019-10-18",null,"15.11.2019"]
[null,{"$f":"IF(szablon_moment_bazowy!$H$12=\"Styczeń_2020\",miesiące_2!D263,C263)","v":"2019-10-19"},"2019-11-16","2019-10-19",null,"16.11.2019"]
[null,{"$f":"IF(szablon_moment_bazowy!$H$12=\"Styczeń_2020\",miesiące_2!D264,C264)","v":"2019-10-20"},"2019-11-17","2019-10-20",null,"17.11.2019"]
[null,{"$f":"IF(szablon_moment_bazowy!$H$12=\"Styczeń_2020\",miesiące_2!D265,C265)","v":"2019-10-21"},"2019-11-18","2019-10-21",null,"18.11.2019"]
[null,{"$f":"IF(szablon_moment_bazowy!$H$12=\"Styczeń_2020\",miesiące_2!D266,C266)","v":"2019-10-22"},"2019-11-19","2019-10-22",null,"19.11.2019"]
[null,{"$f":"IF(szablon_moment_bazowy!$H$12=\"Styczeń_2020\",miesiące_2!D267,C267)","v":"2019-10-23"},"2019-11-20","2019-10-23",null,"20.11.2019"]
[null,{"$f":"IF(szablon_moment_bazowy!$H$12=\"Styczeń_2020\",miesiące_2!D268,C268)","v":"2019-10-24"},"2019-11-21","2019-10-24",null,"21.11.2019"]
[null,{"$f":"IF(szablon_moment_bazowy!$H$12=\"Styczeń_2020\",miesiące_2!D269,C269)","v":"2019-10-25"},"2019-11-22","2019-10-25",null,"22.11.2019"]
[null,{"$f":"IF(szablon_moment_bazowy!$H$12=\"Styczeń_2020\",miesiące_2!D270,C270)","v":"2019-10-26"},"2019-11-23","2019-10-26",null,"23.11.2019"]
[null,{"$f":"IF(szablon_moment_bazowy!$H$12=\"Styczeń_2020\",miesiące_2!D271,C271)","v":"2019-10-27"},"2019-11-24","2019-10-27",null,"24.11.2019"]
[null,{"$f":"IF(szablon_moment_bazowy!$H$12=\"Styczeń_2020\",miesiące_2!D272,C272)","v":"2019-10-28"},"2019-11-25","2019-10-28",null,"25.11.2019"]
[null,{"$f":"IF(szablon_moment_bazowy!$H$12=\"Styczeń_2020\",miesiące_2!D273,C273)","v":"2019-10-29"},"2019-11-26","2019-10-29",null,"26.11.2019"]
[null,{"$f":"IF(szablon_moment_bazowy!$H$12=\"Styczeń_2020\",miesiące_2!D274,C274)","v":"2019-10-30"},"2019-11-27","2019-10-30",null,"27.11.2019"]
[null,{"$f":"IF(szablon_moment_bazowy!$H$12=\"Styczeń_2020\",miesiące_2!D275,C275)","v":"2019-10-31"},"2019-11-28","2019-10-31",null,"28.11.2019"]
[null,{"$f":"IF(szablon_moment_bazowy!$H$12=\"Styczeń_2020\",miesiące_2!D276,C276)","v":"2019-11-01"},"2019-11-29","2019-11-01",null,"29.11.2019"]
[null,{"$f":"IF(szablon_moment_bazowy!$H$12=\"Styczeń_2020\",miesiące_2!D277,C277)","v":"2019-11-02"},"2019-11-30","2019-11-02",null,"30.11.2019"]
[null,{"$f":"IF(szablon_moment_bazowy!$H$12=\"Styczeń_2020\",miesiące_2!D278,C278)","v":"2019-11-03"},"2019-12-01","2019-11-03",null,"01.12.2019"]
[null,{"$f":"IF(szablon_moment_bazowy!$H$12=\"Styczeń_2020\",miesiące_2!D279,C279)","v":"2019-11-04"},"2019-12-02","2019-11-04",null,"02.12.2019"]
[null,{"$f":"IF(szablon_moment_bazowy!$H$12=\"Styczeń_2020\",miesiące_2!D280,C280)","v":"2019-11-05"},"2019-12-03","2019-11-05",null,"03.12.2019"]
[null,{"$f":"IF(szablon_moment_bazowy!$H$12=\"Styczeń_2020\",miesiące_2!D281,C281)","v":"2019-11-06"},"2019-12-04","2019-11-06",null,"04.12.2019"]
[null,{"$f":"IF(szablon_moment_bazowy!$H$12=\"Styczeń_2020\",miesiące_2!D282,C282)","v":"2019-11-07"},"2019-12-05","2019-11-07",null,"05.12.2019"]
[null,{"$f":"IF(szablon_moment_bazowy!$H$12=\"Styczeń_2020\",miesiące_2!D283,C283)","v":"2019-11-08"},"2019-12-06","2019-11-08",null,"06.12.2019"]
[null,{"$f":"IF(szablon_moment_bazowy!$H$12=\"Styczeń_2020\",miesiące_2!D284,C284)","v":"2019-11-09"},"2019-12-07","2019-11-09",null,"07.12.2019"]
[null,{"$f":"IF(szablon_moment_bazowy!$H$12=\"Styczeń_2020\",miesiące_2!D285,C285)","v":"2019-11-10"},"2019-12-08","2019-11-10",null,"08.12.2019"]
[null,{"$f":"IF(szablon_moment_bazowy!$H$12=\"Styczeń_2020\",miesiące_2!D286,C286)","v":"2019-11-11"},"2019-12-09","2019-11-11",null,"09.12.2019"]
[null,{"$f":"IF(szablon_moment_bazowy!$H$12=\"Styczeń_2020\",miesiące_2!D287,C287)","v":"2019-11-12"},"2019-12-10","2019-11-12",null,"10.12.2019"]
[null,{"$f":"IF(szablon_moment_bazowy!$H$12=\"Styczeń_2020\",miesiące_2!D288,C288)","v":"2019-11-13"},"2019-12-11","2019-11-13",null,"11.12.2019"]
[null,{"$f":"IF(szablon_moment_bazowy!$H$12=\"Styczeń_2020\",miesiące_2!D289,C289)","v":"2019-11-14"},"2019-12-12","2019-11-14",null,"12.12.2019"]
[null,{"$f":"IF(szablon_moment_bazowy!$H$12=\"Styczeń_2020\",miesiące_2!D290,C290)","v":"2019-11-15"},"2019-12-13","2019-11-15",null,"13.12.2019"]
[null,{"$f":"IF(szablon_moment_bazowy!$H$12=\"Styczeń_2020\",miesiące_2!D291,C291)","v":"2019-11-16"},"2019-12-14","2019-11-16",null,"14.12.2019"]
[null,{"$f":"IF(szablon_moment_bazowy!$H$12=\"Styczeń_2020\",miesiące_2!D292,C292)","v":"2019-11-17"},"2019-12-15","2019-11-17",null,"15.12.2019"]
[null,{"$f":"IF(szablon_moment_bazowy!$H$12=\"Styczeń_2020\",miesiące_2!D293,C293)","v":"2019-11-18"},"2019-12-16","2019-11-18",null,"16.12.2019"]
[null,{"$f":"IF(szablon_moment_bazowy!$H$12=\"Styczeń_2020\",miesiące_2!D294,C294)","v":"2019-11-19"},"2019-12-17","2019-11-19",null,"17.12.2019"]
[null,{"$f":"IF(szablon_moment_bazowy!$H$12=\"Styczeń_2020\",miesiące_2!D295,C295)","v":"2019-11-20"},"2019-12-18","2019-11-20",null,"18.12.2019"]
[null,{"$f":"IF(szablon_moment_bazowy!$H$12=\"Styczeń_2020\",miesiące_2!D296,C296)","v":"2019-11-21"},"2019-12-19","2019-11-21",null,"19.12.2019"]
[null,{"$f":"IF(szablon_moment_bazowy!$H$12=\"Styczeń_2020\",miesiące_2!D297,C297)","v":"2019-11-22"},"2019-12-20","2019-11-22",null,"20.12.2019"]
[null,{"$f":"IF(szablon_moment_bazowy!$H$12=\"Styczeń_2020\",miesiące_2!D298,C298)","v":"2019-11-23"},"2019-12-21","2019-11-23",null,"21.12.2019"]
[null,{"$f":"IF(szablon_moment_bazowy!$H$12=\"Styczeń_2020\",miesiące_2!D299,C299)","v":"2019-11-24"},"2019-12-22","2019-11-24",null,"22.12.2019"]
[null,{"$f":"IF(szablon_moment_bazowy!$H$12=\"Styczeń_2020\",miesiące_2!D300,C300)","v":"2019-11-25"},"2019-12-23","2019-11-25",null,"23.12.2019"]
[null,{"$f":"IF(szablon_moment_bazowy!$H$12=\"Styczeń_2020\",miesiące_2!D301,C301)","v":"2019-11-26"},"2019-12-24","2019-11-26",null,"24.12.2019"]
[null,{"$f":"IF(szablon_moment_bazowy!$H$12=\"Styczeń_2020\",miesiące_2!D302,C302)","v":"2019-11-27"},"2019-12-25","2019-11-27",null,"25.12.2019"]
[null,{"$f":"IF(szablon_moment_bazowy!$H$12=\"Styczeń_2020\",miesiące_2!D303,C303)","v":"2019-11-28"},"2019-12-26","2019-11-28",null,"26.12.2019"]
[null,{"$f":"IF(szablon_moment_bazowy!$H$12=\"Styczeń_2020\",miesiące_2!D304,C304)","v":"2019-11-29"},"2019-12-27","2019-11-29",null,"27.12.2019"]
[null,{"$f":"IF(szablon_moment_bazowy!$H$12=\"Styczeń_2020\",miesiące_2!D305,C305)","v":"2019-11-30"},"2019-12-28","2019-11-30",null,"28.12.2019"]
[null,{"$f":"IF(szablon_moment_bazowy!$H$12=\"Styczeń_2020\",miesiące_2!D306,C306)","v":"2019-12-01"},"2019-12-29","2019-12-01",null,"29.12.2019"]
[null,{"$f":"IF(szablon_moment_bazowy!$H$12=\"Styczeń_2020\",miesiące_2!D307,C307)","v":"2019-12-02"},"2019-12-30","2019-12-02",null,"30.12.2019"]
[null,{"$f":"IF(szablon_moment_bazowy!$H$12=\"Styczeń_2020\",miesiące_2!D308,C308)","v":"2019-12-03"},"2019-12-31","2019-12-03",null,"31.12.2019"]
[null,{"$f":"IF(szablon_moment_bazowy!$H$12=\"Styczeń_2020\",miesiące_2!D309,C309)","v":"2019-12-04"},"2020-01-01","2019-12-04",null,"01.01.2020"]
[null,{"$f":"IF(szablon_moment_bazowy!$H$12=\"Styczeń_2020\",miesiące_2!D310,C310)","v":"2019-12-05"},"2020-01-02","2019-12-05",null,"02.01.2020"]
[null,{"$f":"IF(szablon_moment_bazowy!$H$12=\"Styczeń_2020\",miesiące_2!D311,C311)","v":"2019-12-06"},"2020-01-03","2019-12-06",null,"03.01.2020"]
[null,{"$f":"IF(szablon_moment_bazowy!$H$12=\"Styczeń_2020\",miesiące_2!D312,C312)","v":"2019-12-07"},"2020-01-04","2019-12-07",null,"04.01.2020"]
[null,{"$f":"IF(szablon_moment_bazowy!$H$12=\"Styczeń_2020\",miesiące_2!D313,C313)","v":"2019-12-08"},"2020-01-05","2019-12-08",null,"05.01.2020"]
[null,{"$f":"IF(szablon_moment_bazowy!$H$12=\"Styczeń_2020\",miesiące_2!D314,C314)","v":"2019-12-09"},"2020-01-06","2019-12-09",null,"06.01.2020"]
[null,{"$f":"IF(szablon_moment_bazowy!$H$12=\"Styczeń_2020\",miesiące_2!D315,C315)","v":"2019-12-10"},"2020-01-07","2019-12-10",null,"07.01.2020"]
[null,{"$f":"IF(szablon_moment_bazowy!$H$12=\"Styczeń_2020\",miesiące_2!D316,C316)","v":"2019-12-11"},"2020-01-08","2019-12-11",null,"08.01.2020"]
[null,{"$f":"IF(szablon_moment_bazowy!$H$12=\"Styczeń_2020\",miesiące_2!D317,C317)","v":"2019-12-12"},"2020-01-09","2019-12-12",null,"09.01.2020"]
[null,{"$f":"IF(szablon_moment_bazowy!$H$12=\"Styczeń_2020\",miesiące_2!D318,C318)","v":"2019-12-13"},"2020-01-10","2019-12-13",null,"10.01.2020"]
[null,{"$f":"IF(szablon_moment_bazowy!$H$12=\"Styczeń_2020\",miesiące_2!D319,C319)","v":"2019-12-14"},"2020-01-11","2019-12-14",null,"11.01.2020"]
[null,{"$f":"IF(szablon_moment_bazowy!$H$12=\"Styczeń_2020\",miesiące_2!D320,C320)","v":"2019-12-15"},"2020-01-12","2019-12-15",null,"12.01.2020"]
[null,{"$f":"IF(szablon_moment_bazowy!$H$12=\"Styczeń_2020\",miesiące_2!D321,C321)","v":"2019-12-16"},"2020-01-13","2019-12-16",null,"13.01.2020"]
[null,{"$f":"IF(szablon_moment_bazowy!$H$12=\"Styczeń_2020\",miesiące_2!D322,C322)","v":"2019-12-17"},"2020-01-14","2019-12-17",null,"14.01.2020"]
[null,{"$f":"IF(szablon_moment_bazowy!$H$12=\"Styczeń_2020\",miesiące_2!D323,C323)","v":"2019-12-18"},"2020-01-15","2019-12-18",null,"15.01.2020"]
[null,{"$f":"IF(szablon_moment_bazowy!$H$12=\"Styczeń_2020\",miesiące_2!D324,C324)","v":"2019-12-19"},"2020-01-16","2019-12-19",null,{"$f":"TEXT(C324,\"dd.mm.rrrrr\")","v":"16.01.2020"}]
[null,{"$f":"IF(szablon_moment_bazowy!$H$12=\"Styczeń_2020\",miesiące_2!D325,C325)","v":"2019-12-20"},"2020-01-17","2019-12-20",null,"17.01.2020"]
[null,{"$f":"IF(szablon_moment_bazowy!$H$12=\"Styczeń_2020\",miesiące_2!D326,C326)","v":"2019-12-21"},"2020-01-18","2019-12-21",null,"18.01.2020"]
[null,{"$f":"IF(szablon_moment_bazowy!$H$12=\"Styczeń_2020\",miesiące_2!D327,C327)","v":"2019-12-22"},"2020-01-19","2019-12-22",null,"19.01.2020"]
[null,{"$f":"IF(szablon_moment_bazowy!$H$12=\"Styczeń_2020\",miesiące_2!D328,C328)","v":"2019-12-23"},"2020-01-20","2019-12-23",null,"20.01.2020"]
[null,{"$f":"IF(szablon_moment_bazowy!$H$12=\"Styczeń_2020\",miesiące_2!D329,C329)","v":"2019-12-24"},"2020-01-21","2019-12-24",null,"21.01.2020"]
[null,{"$f":"IF(szablon_moment_bazowy!$H$12=\"Styczeń_2020\",miesiące_2!D330,C330)","v":"2019-12-25"},"2020-01-22","2019-12-25",null,"22.01.2020"]
[null,{"$f":"IF(szablon_moment_bazowy!$H$12=\"Styczeń_2020\",miesiące_2!D331,C331)","v":"2019-12-26"},"2020-01-23","2019-12-26",null,"23.01.2020"]
[null,{"$f":"IF(szablon_moment_bazowy!$H$12=\"Styczeń_2020\",miesiące_2!D332,C332)","v":"2019-12-27"},"2020-01-24","2019-12-27",null,"24.01.2020"]
[null,{"$f":"IF(szablon_moment_bazowy!$H$12=\"Styczeń_2020\",miesiące_2!D333,C333)","v":"2019-12-28"},"2020-01-25","2019-12-28",null,"25.01.2020"]
[null,{"$f":"IF(szablon_moment_bazowy!$H$12=\"Styczeń_2020\",miesiące_2!D334,C334)","v":"2019-12-29"},"2020-01-26","2019-12-29",null,"26.01.2020"]
[null,{"$f":"IF(szablon_moment_bazowy!$H$12=\"Styczeń_2020\",miesiące_2!D335,C335)","v":"2019-12-30"},"2020-01-27","2019-12-30",null,"27.01.2020"]
[null,{"$f":"IF(szablon_moment_bazowy!$H$12=\"Styczeń_2020\",miesiące_2!D336,C336)","v":"2019-12-31"},"2020-01-28","2019-12-31",null,"28.01.2020"]
[null,{"$f":"IF(szablon_moment_bazowy!$H$12=\"Styczeń_2020\",miesiące_2!D337,C337)","v":"2020-01-01"},"2020-01-29","2020-01-01",null,"29.01.2020"]
[null,{"$f":"IF(szablon_moment_bazowy!$H$12=\"Styczeń_2020\",miesiące_2!D338,C338)","v":"2020-01-02"},"2020-01-30","2020-01-02",null,"30.01.2020"]
[null,{"$f":"IF(szablon_moment_bazowy!$H$12=\"Styczeń_2020\",miesiące_2!D339,C339)","v":"2020-01-03"},"2020-01-31","2020-01-03",null,"31.01.2020"]
[null,{"$f":"IF(szablon_moment_bazowy!$H$12=\"Styczeń_2020\",miesiące_2!D340,C340)","v":"2020-01-04"},"2020-02-01","2020-01-04",null,"01.02.2020"]
[null,{"$f":"IF(szablon_moment_bazowy!$H$12=\"Styczeń_2020\",miesiące_2!D341,C341)","v":"2020-01-05"},"2020-02-02","2020-01-05",null,"02.02.2020"]
[null,{"$f":"IF(szablon_moment_bazowy!$H$12=\"Styczeń_2020\",miesiące_2!D342,C342)","v":"2020-01-06"},"2020-02-03","2020-01-06",null,"03.02.2020"]
[null,{"$f":"IF(szablon_moment_bazowy!$H$12=\"Styczeń_2020\",miesiące_2!D343,C343)","v":"2020-01-07"},"2020-02-04","2020-01-07",null,"04.02.2020"]
[null,{"$f":"IF(szablon_moment_bazowy!$H$12=\"Styczeń_2020\",miesiące_2!D344,C344)","v":"2020-01-08"},"2020-02-05","2020-01-08",null,"05.02.2020"]
[null,{"$f":"IF(szablon_moment_bazowy!$H$12=\"Styczeń_2020\",miesiące_2!D345,C345)","v":"2020-01-09"},"2020-02-06","2020-01-09",null,"06.02.2020"]
[null,{"$f":"IF(szablon_moment_bazowy!$H$12=\"Styczeń_2020\",miesiące_2!D346,C346)","v":"2020-01-10"},"2020-02-07","2020-01-10",null,"07.02.2020"]
[null,{"$f":"IF(szablon_moment_bazowy!$H$12=\"Styczeń_2020\",miesiące_2!D347,C347)","v":"2020-01-11"},"2020-02-08","2020-01-11",null,"08.02.2020"]
[null,{"$f":"IF(szablon_moment_bazowy!$H$12=\"Styczeń_2020\",miesiące_2!D348,C348)","v":"2020-01-12"},"2020-02-09","2020-01-12",null,"09.02.2020"]
[null,{"$f":"IF(szablon_moment_bazowy!$H$12=\"Styczeń_2020\",miesiące_2!D349,C349)","v":"2020-01-13"},"2020-02-10","2020-01-13",null,"10.02.2020"]
[null,{"$f":"IF(szablon_moment_bazowy!$H$12=\"Styczeń_2020\",miesiące_2!D350,C350)","v":"2020-01-14"},"2020-02-11","2020-01-14",null,"11.02.2020"]
[null,{"$f":"IF(szablon_moment_bazowy!$H$12=\"Styczeń_2020\",miesiące_2!D351,C351)","v":"2020-01-15"},"2020-02-12","2020-01-15",null,"12.02.2020"]
[null,{"$f":"IF(szablon_moment_bazowy!$H$12=\"Styczeń_2020\",miesiące_2!D352,C352)","v":"2020-01-16"},"2020-02-13","2020-01-16",null,"13.02.2020"]
[null,{"$f":"IF(szablon_moment_bazowy!$H$12=\"Styczeń_2020\",miesiące_2!D353,C353)","v":"2020-01-17"},"2020-02-14","2020-01-17",null,"14.02.2020"]
[null,{"$f":"IF(szablon_moment_bazowy!$H$12=\"Styczeń_2020\",miesiące_2!D354,C354)","v":"2020-01-18"},"2020-02-15","2020-01-18",null,"15.02.2020"]
[null,{"$f":"IF(szablon_moment_bazowy!$H$12=\"Styczeń_2020\",miesiące_2!D355,C355)","v":"2020-01-19"},"2020-02-16","2020-01-19",null,"16.02.2020"]
[null,{"$f":"IF(szablon_moment_bazowy!$H$12=\"Styczeń_2020\",miesiące_2!D356,C356)","v":"2020-01-20"},"2020-02-17","2020-01-20",null,"17.02.2020"]
[null,{"$f":"IF(szablon_moment_bazowy!$H$12=\"Styczeń_2020\",miesiące_2!D357,C357)","v":"2020-01-21"},"2020-02-18","2020-01-21",null,"18.02.2020"]
[null,{"$f":"IF(szablon_moment_bazowy!$H$12=\"Styczeń_2020\",miesiące_2!D358,C358)","v":"2020-01-22"},"2020-02-19","2020-01-22",null,"19.02.2020"]
[null,{"$f":"IF(szablon_moment_bazowy!$H$12=\"Styczeń_2020\",miesiące_2!D359,C359)","v":"2020-01-23"},"2020-02-20","2020-01-23",null,"20.02.2020"]
[null,{"$f":"IF(szablon_moment_bazowy!$H$12=\"Styczeń_2020\",miesiące_2!D360,C360)","v":"2020-01-24"},"2020-02-21","2020-01-24",null,"21.02.2020"]
[null,{"$f":"IF(szablon_moment_bazowy!$H$12=\"Styczeń_2020\",miesiące_2!D361,C361)","v":"2020-01-25"},"2020-02-22","2020-01-25",null,"22.02.2020"]
[null,{"$f":"IF(szablon_moment_bazowy!$H$12=\"Styczeń_2020\",miesiące_2!D362,C362)","v":"2020-01-26"},"2020-02-23","2020-01-26",null,"23.02.2020"]
[null,{"$f":"IF(szablon_moment_bazowy!$H$12=\"Styczeń_2020\",miesiące_2!D363,C363)","v":"2020-01-27"},"2020-02-24","2020-01-27",null,"24.02.2020"]
[null,{"$f":"IF(szablon_moment_bazowy!$H$12=\"Styczeń_2020\",miesiące_2!D364,C364)","v":"2020-01-28"},"2020-02-25","2020-01-28",null,"25.02.2020"]
[null,{"$f":"IF(szablon_moment_bazowy!$H$12=\"Styczeń_2020\",miesiące_2!D365,C365)","v":"2020-01-29"},"2020-02-26","2020-01-29",null,"26.02.2020"]
[null,{"$f":"IF(szablon_moment_bazowy!$H$12=\"Styczeń_2020\",miesiące_2!D366,C366)","v":"2020-01-30"},"2020-02-27","2020-01-30",null,"27.02.2020"]
[null,{"$f":"IF(szablon_moment_bazowy!$H$12=\"Styczeń_2020\",miesiące_2!D367,C367)","v":"2020-01-31"},"2020-02-28","2020-01-31",null,"28.02.2020"]
[null,{"$f":"IF(szablon_moment_bazowy!$H$12=\"Styczeń_2020\",miesiące_2!D368,C368)","v":"   "},"2020-02-29","   ",null,"29.02.2020"]

{"sheet":"Tabela miesiące","index":4,"n_rows":367,"n_cols":12,"rows_kept":367,"cut":false,"hidden":true,"merged":[]}
["LP.","Miesiąc","Liczba dni",null,null,null,null,"Marzec_2020",null,"Marzec 2019","Kwiecień 2019","Maj 2019"]
[1,"Marzec_2020",31,null,null,null,null,"2019-03-01",null,"2019-03-01","2019-04-01","2019-05-01"]
[2,"Luty_2020",29,null,null,null,null,"2019-03-02",null,"2019-03-02","2019-04-02","2019-05-02"]
[3,"Styczeń_2020",31,null,null,null,null,"2019-03-03",null,"2019-03-03","2019-04-03","2019-05-03"]
[4,"Grudzień_2019",31,null,null,null,null,"2019-03-04",null,"2019-03-04","2019-04-04","2019-05-04"]
[5,"Listopad_2019",30,null,null,null,null,"2019-03-05",null,"2019-03-05","2019-04-05","2019-05-05"]
[6,"Październik_2019",31,null,null,null,null,"2019-03-06",null,"2019-03-06","2019-04-06","2019-05-06"]
[7,"Wrzesień_2019",30,null,null,null,null,"2019-03-07",null,"2019-03-07","2019-04-07","2019-05-07"]
[8,"Sierpień_2019",31,null,null,null,null,"2019-03-08",null,"2019-03-08","2019-04-08","2019-05-08"]
[9,"Lipiec_2019",31,null,null,null,null,"2019-03-09",null,"2019-03-09","2019-04-09","2019-05-09"]
[10,"Czerwiec_2019",30,null,null,null,null,"2019-03-10",null,"2019-03-10","2019-04-10","2019-05-10"]
[11,"Maj_2019",31,null,null,null,null,"2019-03-11",null,"2019-03-11","2019-04-11","2019-05-11"]
[12,"Kwiecień_2019",30,null,null,null,null,"2019-03-12",null,"2019-03-12","2019-04-12","2019-05-12"]
[13,"Marzec_2019",31,null,null,null,null,"2019-03-13",null,"2019-03-13","2019-04-13","2019-05-13"]
[14,"Luty_2019",28,null,null,null,null,"2019-03-14",null,"2019-03-14","2019-04-14","2019-05-14"]
[null,null,null,null,null,null,null,"2019-03-15",null,"2019-03-15","2019-04-15","2019-05-15"]
[null,null,null,null,null,null,null,"2019-03-16",null,"2019-03-16","2019-04-16","2019-05-16"]
[null,null,null,null,null,null,null,"2019-03-17",null,"2019-03-17","2019-04-17","2019-05-17"]
[null,null,null,null,null,null,null,"2019-03-18",null,"2019-03-18","2019-04-18","2019-05-18"]
[null,null,null,null,null,null,null,"2019-03-19",null,"2019-03-19","2019-04-19","2019-05-19"]
[null,null,null,null,null,null,null,"2019-03-20",null,"2019-03-20","2019-04-20","2019-05-20"]
[null,null,null,null,null,null,null,"2019-03-21",null,"2019-03-21","2019-04-21","2019-05-21"]
[null,null,null,null,null,null,null,"2019-03-22",null,"2019-03-22","2019-04-22","2019-05-22"]
[null,null,null,null,null,null,null,"2019-03-23",null,"2019-03-23","2019-04-23","2019-05-23"]
[null,null,null,null,null,null,null,"2019-03-24",null,"2019-03-24","2019-04-24","2019-05-24"]
[null,null,null,null,null,null,null,"2019-03-25",null,"2019-03-25","2019-04-25","2019-05-25"]
[null,null,null,null,null,null,null,"2019-03-26",null,"2019-03-26","2019-04-26","2019-05-26"]
[null,null,null,null,null,null,null,"2019-03-27",null,"2019-03-27","2019-04-27","2019-05-27"]
[null,null,null,null,null,null,null,"2019-03-28",null,"2019-03-28","2019-04-28","2019-05-28"]
[null,null,null,null,null,null,null,"2019-03-29",null,"2019-03-29","2019-04-29","2019-05-29"]
[null,null,null,null,null,null,null,"2019-03-30",null,"2019-03-30","2019-04-30","2019-05-30"]
[null,null,null,null,null,null,null,"2019-03-31",null,"2019-03-31",null,"2019-05-31"]
[null,null,null,null,null,null,null,"2019-04-01"]
[null,null,null,null,null,null,null,"2019-04-02"]
[null,null,null,null,null,null,null,"2019-04-03"]
[null,null,null,null,null,null,null,"2019-04-04"]
[null,null,null,null,null,null,null,"2019-04-05"]
[null,null,null,null,null,null,null,"2019-04-06"]
[null,null,null,null,null,null,null,"2019-04-07"]
[null,null,null,null,null,null,null,"2019-04-08"]
[null,null,null,null,null,null,null,"2019-04-09"]
[null,null,null,null,null,null,null,"2019-04-10"]
[null,null,null,null,null,null,null,"2019-04-11"]
[null,null,null,null,null,null,null,"2019-04-12"]
[null,null,null,null,null,null,null,"2019-04-13"]
[null,null,null,null,null,null,null,"2019-04-14"]
[null,null,null,null,null,null,null,"2019-04-15"]
[null,null,null,null,null,null,null,"2019-04-16"]
[null,null,null,null,null,null,null,"2019-04-17"]
[null,null,null,null,null,null,null,"2019-04-18"]
[null,null,null,null,null,null,null,"2019-04-19"]
[null,null,null,null,null,null,null,"2019-04-20"]
[null,null,null,null,null,null,null,"2019-04-21"]
[null,null,null,null,null,null,null,"2019-04-22"]
[null,null,null,null,null,null,null,"2019-04-23"]
[null,null,null,null,null,null,null,"2019-04-24"]
[null,null,null,null,null,null,null,"2019-04-25"]
[null,null,null,null,null,null,null,"2019-04-26"]
[null,null,null,null,null,null,null,"2019-04-27"]
[null,null,null,null,null,null,null,"2019-04-28"]
[null,null,null,null,null,null,null,"2019-04-29"]
[null,null,null,null,null,null,null,"2019-04-30"]
[null,null,null,null,null,null,null,"2019-05-01"]
[null,null,null,null,null,null,null,"2019-05-02",null,null,null,"2019-05-02"]
[null,null,null,null,null,null,null,"2019-05-03",null,null,null,"2019-05-03"]
[null,null,null,null,null,null,null,"2019-05-04",null,null,null,"2019-05-04"]
[null,null,null,null,null,null,null,"2019-05-05",null,null,null,"2019-05-05"]
[null,null,null,null,null,null,null,"2019-05-06",null,null,null,"2019-05-06"]
[null,null,null,null,null,null,null,"2019-05-07",null,null,null,"2019-05-07"]
[null,null,null,null,null,null,null,"2019-05-08",null,null,null,"2019-05-08"]
[null,null,null,null,null,null,null,"2019-05-09",null,null,null,"2019-05-09"]
[null,null,null,null,null,null,null,"2019-05-10",null,null,null,"2019-05-10"]
[null,null,null,null,null,null,null,"2019-05-11",null,null,null,"2019-05-11"]
[null,null,null,null,null,null,null,"2019-05-12",null,null,null,"2019-05-12"]
[null,null,null,null,null,null,null,"2019-05-13",null,null,null,"2019-05-13"]
[null,null,null,null,null,null,null,"2019-05-14",null,null,null,"2019-05-14"]
[null,null,null,null,null,null,null,"2019-05-15",null,null,null,"2019-05-15"]
[null,null,null,null,null,null,null,"2019-05-16",null,null,null,"2019-05-16"]
[null,null,null,null,null,null,null,"2019-05-17",null,null,null,"2019-05-17"]
[null,null,null,null,null,null,null,"2019-05-18",null,null,null,"2019-05-18"]
[null,null,null,null,null,null,null,"2019-05-19",null,null,null,"2019-05-19"]
[null,null,null,null,null,null,null,"2019-05-20",null,null,null,"2019-05-20"]
[null,null,null,null,null,null,null,"2019-05-21",null,null,null,"2019-05-21"]
[null,null,null,null,null,null,null,"2019-05-22",null,null,null,"2019-05-22"]
[null,null,null,null,null,null,null,"2019-05-23",null,null,null,"2019-05-23"]
[null,null,null,null,null,null,null,"2019-05-24",null,null,null,"2019-05-24"]
[null,null,null,null,null,null,null,"2019-05-25",null,null,null,"2019-05-25"]
[null,null,null,null,null,null,null,"2019-05-26",null,null,null,"2019-05-26"]
[null,null,null,null,null,null,null,"2019-05-27",null,null,null,"2019-05-27"]
[null,null,null,null,null,null,null,"2019-05-28",null,null,null,"2019-05-28"]
[null,null,null,null,null,null,null,"2019-05-29",null,null,null,"2019-05-29"]
[null,null,null,null,null,null,null,"2019-05-30",null,null,null,"2019-05-30"]
[null,null,null,null,null,null,null,"2019-05-31",null,null,null,"2019-05-31"]
[null,null,null,null,null,null,null,"2019-06-01"]
[null,null,null,null,null,null,null,"2019-06-02"]
[null,null,null,null,null,null,null,"2019-06-03"]
[null,null,null,null,null,null,null,"2019-06-04"]
[null,null,null,null,null,null,null,"2019-06-05"]
[null,null,null,null,null,null,null,"2019-06-06"]
[null,null,null,null,null,null,null,"2019-06-07"]
[null,null,null,null,null,null,null,"2019-06-08"]
[null,null,null,null,null,null,null,"2019-06-09"]
[null,null,null,null,null,null,null,"2019-06-10"]
[null,null,null,null,null,null,null,"2019-06-11"]
[null,null,null,null,null,null,null,"2019-06-12"]
[null,null,null,null,null,null,null,"2019-06-13"]
[null,null,null,null,null,null,null,"2019-06-14"]
[null,null,null,null,null,null,null,"2019-06-15"]
[null,null,null,null,null,null,null,"2019-06-16"]
[null,null,null,null,null,null,null,"2019-06-17"]
[null,null,null,null,null,null,null,"2019-06-18"]
[null,null,null,null,null,null,null,"2019-06-19"]
[null,null,null,null,null,null,null,"2019-06-20"]
[null,null,null,null,null,null,null,"2019-06-21"]
[null,null,null,null,null,null,null,"2019-06-22"]
[null,null,null,null,null,null,null,"2019-06-23"]
[null,null,null,null,null,null,null,"2019-06-24"]
[null,null,null,null,null,null,null,"2019-06-25"]
[null,null,null,null,null,null,null,"2019-06-26"]
[null,null,null,null,null,null,null,"2019-06-27"]
[null,null,null,null,null,null,null,"2019-06-28"]
[null,null,null,null,null,null,null,"2019-06-29"]
[null,null,null,null,null,null,null,"2019-06-30"]
[null,null,null,null,null,null,null,"2019-07-01"]
[null,null,null,null,null,null,null,"2019-07-02"]
[null,null,null,null,null,null,null,"2019-07-03"]
[null,null,null,null,null,null,null,"2019-07-04"]
[null,null,null,null,null,null,null,"2019-07-05"]
[null,null,null,null,null,null,null,"2019-07-06"]
[null,null,null,null,null,null,null,"2019-07-07"]
[null,null,null,null,null,null,null,"2019-07-08"]
[null,null,null,null,null,null,null,"2019-07-09"]
[null,null,null,null,null,null,null,"2019-07-10"]
[null,null,null,null,null,null,null,"2019-07-11"]
[null,null,null,null,null,null,null,"2019-07-12"]
[null,null,null,null,null,null,null,"2019-07-13"]
[null,null,null,null,null,null,null,"2019-07-14"]
[null,null,null,null,null,null,null,"2019-07-15"]
[null,null,null,null,null,null,null,"2019-07-16"]
[null,null,null,null,null,null,null,"2019-07-17"]
[null,null,null,null,null,null,null,"2019-07-18"]
[null,null,null,null,null,null,null,"2019-07-19"]
[null,null,null,null,null,null,null,"2019-07-20"]
[null,null,null,null,null,null,null,"2019-07-21"]
[null,null,null,null,null,null,null,"2019-07-22"]
[null,null,null,null,null,null,null,"2019-07-23"]
[null,null,null,null,null,null,null,"2019-07-24"]
[null,null,null,null,null,null,null,"2019-07-25"]
[null,null,null,null,null,null,null,"2019-07-26"]
[null,null,null,null,null,null,null,"2019-07-27"]
[null,null,null,null,null,null,null,"2019-07-28"]
[null,null,null,null,null,null,null,"2019-07-29"]
[null,null,null,null,null,null,null,"2019-07-30"]
[null,null,null,null,null,null,null,"2019-07-31"]
[null,null,null,null,null,null,null,"2019-08-01"]
[null,null,null,null,null,null,null,"2019-08-02"]
[null,null,null,null,null,null,null,"2019-08-03"]
[null,null,null,null,null,null,null,"2019-08-04"]
[null,null,null,null,null,null,null,"2019-08-05"]
[null,null,null,null,null,null,null,"2019-08-06"]
[null,null,null,null,null,null,null,"2019-08-07"]
[null,null,null,null,null,null,null,"2019-08-08"]
[null,null,null,null,null,null,null,"2019-08-09"]
[null,null,null,null,null,null,null,"2019-08-10"]
[null,null,null,null,null,null,null,"2019-08-11"]
[null,null,null,null,null,null,null,"2019-08-12"]
[null,null,null,null,null,null,null,"2019-08-13"]
[null,null,null,null,null,null,null,"2019-08-14"]
[null,null,null,null,null,null,null,"2019-08-15"]
[null,null,null,null,null,null,null,"2019-08-16"]
[null,null,null,null,null,null,null,"2019-08-17"]
[null,null,null,null,null,null,null,"2019-08-18"]
[null,null,null,null,null,null,null,"2019-08-19"]
[null,null,null,null,null,null,null,"2019-08-20"]
[null,null,null,null,null,null,null,"2019-08-21"]
[null,null,null,null,null,null,null,"2019-08-22"]
[null,null,null,null,null,null,null,"2019-08-23"]
[null,null,null,null,null,null,null,"2019-08-24"]
[null,null,null,null,null,null,null,"2019-08-25"]
[null,null,null,null,null,null,null,"2019-08-26"]
[null,null,null,null,null,null,null,"2019-08-27"]
[null,null,null,null,null,null,null,"2019-08-28"]
[null,null,null,null,null,null,null,"2019-08-29"]
[null,null,null,null,null,null,null,"2019-08-30"]
[null,null,null,null,null,null,null,"2019-08-31"]
[null,null,null,null,null,null,null,"2019-09-01"]
[null,null,null,null,null,null,null,"2019-09-02"]
[null,null,null,null,null,null,null,"2019-09-03"]
[null,null,null,null,null,null,null,"2019-09-04"]
[null,null,null,null,null,null,null,"2019-09-05"]
[null,null,null,null,null,null,null,"2019-09-06"]
[null,null,null,null,null,null,null,"2019-09-07"]
[null,null,null,null,null,null,null,"2019-09-08"]
[null,null,null,null,null,null,null,"2019-09-09"]
[null,null,null,null,null,null,null,"2019-09-10"]
[null,null,null,null,null,null,null,"2019-09-11"]
[null,null,null,null,null,null,null,"2019-09-12"]
[null,null,null,null,null,null,null,"2019-09-13"]
[null,null,null,null,null,null,null,"2019-09-14"]
[null,null,null,null,null,null,null,"2019-09-15"]
[null,null,null,null,null,null,null,"2019-09-16"]
[null,null,null,null,null,null,null,"2019-09-17"]
[null,null,null,null,null,null,null,"2019-09-18"]
[null,null,null,null,null,null,null,"2019-09-19"]
[null,null,null,null,null,null,null,"2019-09-20"]
[null,null,null,null,null,null,null,"2019-09-21"]
[null,null,null,null,null,null,null,"2019-09-22"]
[null,null,null,null,null,null,null,"2019-09-23"]
[null,null,null,null,null,null,null,"2019-09-24"]
[null,null,null,null,null,null,null,"2019-09-25"]
[null,null,null,null,null,null,null,"2019-09-26"]
[null,null,null,null,null,null,null,"2019-09-27"]
[null,null,null,null,null,null,null,"2019-09-28"]
[null,null,null,null,null,null,null,"2019-09-29"]
[null,null,null,null,null,null,null,"2019-09-30"]
[null,null,null,null,null,null,null,"2019-10-01"]
[null,null,null,null,null,null,null,"2019-10-02"]
[null,null,null,null,null,null,null,"2019-10-03"]
[null,null,null,null,null,null,null,"2019-10-04"]
[null,null,null,null,null,null,null,"2019-10-05"]
[null,null,null,null,null,null,null,"2019-10-06"]
[null,null,null,null,null,null,null,"2019-10-07"]
[null,null,null,null,null,null,null,"2019-10-08"]
[null,null,null,null,null,null,null,"2019-10-09"]
[null,null,null,null,null,null,null,"2019-10-10"]
[null,null,null,null,null,null,null,"2019-10-11"]
[null,null,null,null,null,null,null,"2019-10-12"]
[null,null,null,null,null,null,null,"2019-10-13"]
[null,null,null,null,null,null,null,"2019-10-14"]
[null,null,null,null,null,null,null,"2019-10-15"]
[null,null,null,null,null,null,null,"2019-10-16"]
[null,null,null,null,null,null,null,"2019-10-17"]
[null,null,null,null,null,null,null,"2019-10-18"]
[null,null,null,null,null,null,null,"2019-10-19"]
[null,null,null,null,null,null,null,"2019-10-20"]
[null,null,null,null,null,null,null,"2019-10-21"]
[null,null,null,null,null,null,null,"2019-10-22"]
[null,null,null,null,null,null,null,"2019-10-23"]
[null,null,null,null,null,null,null,"2019-10-24"]
[null,null,null,null,null,null,null,"2019-10-25"]
[null,null,null,null,null,null,null,"2019-10-26"]
[null,null,null,null,null,null,null,"2019-10-27"]
[null,null,null,null,null,null,null,"2019-10-28"]
[null,null,null,null,null,null,null,"2019-10-29"]
[null,null,null,null,null,null,null,"2019-10-30"]
[null,null,null,null,null,null,null,"2019-10-31"]
[null,null,null,null,null,null,null,"2019-11-01"]
[null,null,null,null,null,null,null,"2019-11-02"]
[null,null,null,null,null,null,null,"2019-11-03"]
[null,null,null,null,null,null,null,"2019-11-04"]
[null,null,null,null,null,null,null,"2019-11-05"]
[null,null,null,null,null,null,null,"2019-11-06"]
[null,null,null,null,null,null,null,"2019-11-07"]
[null,null,null,null,null,null,null,"2019-11-08"]
[null,null,null,null,null,null,null,"2019-11-09"]
[null,null,null,null,null,null,null,"2019-11-10"]
[null,null,null,null,null,null,null,"2019-11-11"]
[null,null,null,null,null,null,null,"2019-11-12"]
[null,null,null,null,null,null,null,"2019-11-13"]
[null,null,null,null,null,null,null,"2019-11-14"]
[null,null,null,null,null,null,null,"2019-11-15"]
[null,null,null,null,null,null,null,"2019-11-16"]
[null,null,null,null,null,null,null,"2019-11-17"]
[null,null,null,null,null,null,null,"2019-11-18"]
[null,null,null,null,null,null,null,"2019-11-19"]
[null,null,null,null,null,null,null,"2019-11-20"]
[null,null,null,null,null,null,null,"2019-11-21"]
[null,null,null,null,null,null,null,"2019-11-22"]
[null,null,null,null,null,null,null,"2019-11-23"]
[null,null,null,null,null,null,null,"2019-11-24"]
[null,null,null,null,null,null,null,"2019-11-25"]
[null,null,null,null,null,null,null,"2019-11-26"]
[null,null,null,null,null,null,null,"2019-11-27"]
[null,null,null,null,null,null,null,"2019-11-28"]
[null,null,null,null,null,null,null,"2019-11-29"]
[null,null,null,null,null,null,null,"2019-11-30"]
[null,null,null,null,null,null,null,"2019-12-01"]
[null,null,null,null,null,null,null,"2019-12-02"]
[null,null,null,null,null,null,null,"2019-12-03"]
[null,null,null,null,null,null,null,"2019-12-04"]
[null,null,null,null,null,null,null,"2019-12-05"]
[null,null,null,null,null,null,null,"2019-12-06"]
[null,null,null,null,null,null,null,"2019-12-07"]
[null,null,null,null,null,null,null,"2019-12-08"]
[null,null,null,null,null,null,null,"2019-12-09"]
[null,null,null,null,null,null,null,"2019-12-10"]
[null,null,null,null,null,null,null,"2019-12-11"]
[null,null,null,null,null,null,null,"2019-12-12"]
[null,null,null,null,null,null,null,"2019-12-13"]
[null,null,null,null,null,null,null,"2019-12-14"]
[null,null,null,null,null,null,null,"2019-12-15"]
[null,null,null,null,null,null,null,"2019-12-16"]
[null,null,null,null,null,null,null,"2019-12-17"]
[null,null,null,null,null,null,null,"2019-12-18"]
[null,null,null,null,null,null,null,"2019-12-19"]
[null,null,null,null,null,null,null,"2019-12-20"]
[null,null,null,null,null,null,null,"2019-12-21"]
[null,null,null,null,null,null,null,"2019-12-22"]
[null,null,null,null,null,null,null,"2019-12-23"]
[null,null,null,null,null,null,null,"2019-12-24"]
[null,null,null,null,null,null,null,"2019-12-25"]
[null,null,null,null,null,null,null,"2019-12-26"]
[null,null,null,null,null,null,null,"2019-12-27"]
[null,null,null,null,null,null,null,"2019-12-28"]
[null,null,null,null,null,null,null,"2019-12-29"]
[null,null,null,null,null,null,null,"2019-12-30"]
[null,null,null,null,null,null,null,"2019-12-31"]
[null,null,null,null,null,null,null,"2020-01-01"]
[null,null,null,null,null,null,null,"2020-01-02"]
[null,null,null,null,null,null,null,"2020-01-03"]
[null,null,null,null,null,null,null,"2020-01-04"]
[null,null,null,null,null,null,null,"2020-01-05"]
[null,null,null,null,null,null,null,"2020-01-06"]
[null,null,null,null,null,null,null,"2020-01-07"]
[null,null,null,null,null,null,null,"2020-01-08"]
[null,null,null,null,null,null,null,"2020-01-09"]
[null,null,null,null,null,null,null,"2020-01-10"]
[null,null,null,null,null,null,null,"2020-01-11"]
[null,null,null,null,null,null,null,"2020-01-12"]
[null,null,null,null,null,null,null,"2020-01-13"]
[null,null,null,null,null,null,null,"2020-01-14"]
[null,null,null,null,null,null,null,"2020-01-15"]
[null,null,null,null,null,null,null,"2020-01-16"]
[null,null,null,null,null,null,null,"2020-01-17"]
[null,null,null,null,null,null,null,"2020-01-18"]
[null,null,null,null,null,null,null,"2020-01-19"]
[null,null,null,null,null,null,null,"2020-01-20"]
[null,null,null,null,null,null,null,"2020-01-21"]
[null,null,null,null,null,null,null,"2020-01-22"]
[null,null,null,null,null,null,null,"2020-01-23"]
[null,null,null,null,null,null,null,"2020-01-24"]
[null,null,null,null,null,null,null,"2020-01-25"]
[null,null,null,null,null,null,null,"2020-01-26"]
[null,null,null,null,null,null,null,"2020-01-27"]
[null,null,null,null,null,null,null,"2020-01-28"]
[null,null,null,null,null,null,null,"2020-01-29"]
[null,null,null,null,null,null,null,"2020-01-30"]
[null,null,null,null,null,null,null,"2020-01-31"]
[null,null,null,null,null,null,null,"2020-02-01"]
[null,null,null,null,null,null,null,"2020-02-02"]
[null,null,null,null,null,null,null,"2020-02-03"]
[null,null,null,null,null,null,null,"2020-02-04"]
[null,null,null,null,null,null,null,"2020-02-05"]
[null,null,null,null,null,null,null,"2020-02-06"]
[null,null,null,null,null,null,null,"2020-02-07"]
[null,null,null,null,null,null,null,"2020-02-08"]
[null,null,null,null,null,null,null,"2020-02-09"]
[null,null,null,null,null,null,null,"2020-02-10"]
[null,null,null,null,null,null,null,"2020-02-11"]
[null,null,null,null,null,null,null,"2020-02-12"]
[null,null,null,null,null,null,null,"2020-02-13"]
[null,null,null,null,null,null,null,"2020-02-14"]
[null,null,null,null,null,null,null,"2020-02-15"]
[null,null,null,null,null,null,null,"2020-02-16"]
[null,null,null,null,null,null,null,"2020-02-17"]
[null,null,null,null,null,null,null,"2020-02-18"]
[null,null,null,null,null,null,null,"2020-02-19"]
[null,null,null,null,null,null,null,"2020-02-20"]
[null,null,null,null,null,null,null,"2020-02-21"]
[null,null,null,null,null,null,null,"2020-02-22"]
[null,null,null,null,null,null,null,"2020-02-23"]
[null,null,null,null,null,null,null,"2020-02-24"]
[null,null,null,null,null,null,null,"2020-02-25"]
[null,null,null,null,null,null,null,"2020-02-26"]
[null,null,null,null,null,null,null,"2020-02-27"]
[null,null,null,null,null,null,null,"2020-02-28"]
[null,null,null,null,null,null,null,"2020-02-29"]