{"text_format":"1","workbook":"xlsx","n_sheets":5,"sheets":["szablon_moment_bazowy","instrukcja_obsługi_makr","Arkusz2","miesiące_2","Tabela miesiące"],"not_rendered":{"charts":0,"images":7,"macros":1,"external_links":0,"defined_names":5,"comments":1,"pivot_tables":0},"unopened":[],"bounds":{"document_bytes":16777216,"sheet_cells":100000,"rows_first":2000,"rows_last":500,"rows_between":2000,"halvings":0,"cell_chars":16384,"cell_head_chars":4096},"cells_cut":0,"cells_raw":0,"read":"whole","date_system":"1900"}

{"sheet":"szablon_moment_bazowy","index":0,"n_rows":62,"n_cols":35,"rows_kept":62,"cut":false,"hidden":false,"merged":[[7,0,7,16],[0,0,0,22],[3,0,3,22],[4,0,4,16],[5,0,5,16],[6,0,6,16],[2,0,2,16],[1,0,1,22],[8,0,8,16],[10,0,10,1],[10,5,10,6],[10,7,10,9],[10,10,10,12],[10,14,23,22],[11,5,11,6],[11,7,11,9],[11,10,11,12],[12,0,16,1],[12,2,16,3],[12,5,12,6],[12,7,12,9],[12,10,12,12],[13,5,13,6],[13,7,13,9],[13,10,13,12],[14,5,14,6],[14,7,14,9],[14,10,14,12],[15,5,15,6],[15,7,15,9],[15,10,15,12],[16,5,16,6],[16,7,16,9],[16,10,16,12],[17,5,17,6],[17,7,17,9],[17,10,17,12],[18,5,18,6],[18,7,18,9],[18,10,18,12],[19,5,19,6],[19,7,19,9],[19,10,19,12],[20,5,20,6],[20,7,20,9],[20,10,20,12],[21,5,21,6],[21,7,21,9],[21,10,21,12],[22,5,22,6],[22,7,22,9],[22,10,22,12],[23,5,23,9],[23,10,23,12],[26,0,26,1],[26,3,26,4],[26,6,26,7],[26,9,26,10],[26,12,26,13],[23,2,23,3],[26,33,26,34],[26,15,26,16],[26,18,26,19],[26,21,26,22],[26,24,26,25],[26,27,26,28],[26,30,26,31]]}
["Obliczenie danych dotyczących zatrudnienia na potrzeby określenia momentu bazowego",null,null,null,null,null,null,null,null,null,null,null,null,null,null,null,null,null,null,null,null,null,null,null,null,"$C$24"]
["Tabela pomocnicza do wyliczenia momentu bazowego - szczegółowa metoda wyliczenia znajduje się w dokumentach aplikacyjnych tj. w  Załączniku do Instrukcji wypełniania wniosku o przyznanie pomocy:\n  - Załącznik nr 1 - Informacje dotyczące wypełniania biznesplanu"]
[" Uwaga!\n Niniejszy szablon służy do przeliczenia zatrudnienia na potrzeby określenia momentu bazowego  dla naboru  wniosków o przyznanie pomocy (WoPP) od 28.02.2020 r. do 28.03.2020 r.\n W związku z powyższym pole wyboru dotyczące miesiąca złożenia WoPP zostało ograniczone do miesięcy:\n  - luty 2020,\n  - marzec 2020"]
["Instrukcja:"]
["1.Należy wprowadzać właściwe dane do pól zaznaczonych kolorem żółtym."]
["2.Należy wskazać miesiąc złożenia wniosku o przyznanie pomocy poprzez wybranie z listy rozwijanej. \n\n3.Następnie należy przejść do pola \"data rozpoczęcia  działalności gospodarczej i z listy rozwijanej wybrać datę. Nastąpi automatyczne\n   przeniesienie do pola z odpowiednią datą. Wpisanie wartości do pola spowoduje automatyczne uzupełnienie pól, począwszy od  wybranej daty do\n   końca okresu, wartościami \"1\" (osoba prowadząca działalność gospodarczą). \n   Pola wypełnione wartościami \"1\" można nadpisywać wartościami wyższymi  (np. w przypadku zatrudnienia pracowników), ale nie niższymi niż \"1\" (osoba \n   prowadząca działalność gospodarczą) .\n   W przypadku prowadzenia działalności gospodarczej szablon nie  pozwala na wpisanie wartości mniejszej niż \"1\" .\n4. Uwaga! W przypadku wybrania daty i umieszczenia wpisów, a następnie dokonania wyboru opcji \"(wybierz z listy)\"  (dotyczy pola \"data rozpoczęcia\n    działalności  gospodarczej\") , nastąpi wyczyszczenie wszystkich wcześniej dokonanych wpisów! Zmiana w polu \"Miesiąc złożenia WoPP i wybranie\n    innego miesiąca  również spowoduje wyczyszczenie wpisów ze wszystkich miesięcy arkusza."]
["5. W przypadku działalności prowadzonej krócej niż dwanaście miesięcy i rozpoczętej nie z pierwszym dniem danego miesiąca, pola dotyczące  dni, w których nie była jeszcze prowadzona działalność powinny być puste (nie mogą zawierać nawet wartości \"0\"). Natomiast od dnia rozpoczęcia działalności wszystkie pola powinny być wypełnione co najmniej wartością 1 (osoba prowadząca działalnośc gospodarczą).\n"]
["6. Dla dni wolnych od pracy należy przyjąć stan z poprzedzającego dnia roboczego, o ile w tym dniu nie została rozwiązana umowa  o pracę z pracownikiem."]
["7. Jeżeli liczba dni w miesiącu jest mniejsza niż 31 (dotyczy to np. miesiąca lutego) to w przypadku dni, dla których pole \"Średni poziom zatrudnienia w miesiącu\" ma kolor biały  nie należy wpisywać żadnych wartości! Wpis zostanie automatycznie usunięty!"]
[]
["Miesiąc złożenia \nWoPP",null,null,2,null,"Kolejne miesiące poprzedzające miesiąc złożenia WoPP",null,"Miesiąc",null,null,"Średni poziom zatrudnienia w miesiącu",null,null,null,"Do stanu zatrudnienia nie należy wliczać pracowników przebywających na urlopie: \n• bezpłatnym (kod świadczenia/przerwy 111);\n• macierzyńskim (kod świadczenia/przerwy 311; kod tytułu ubezpieczenia 12 40);\n• bezpłatnym w celu sprawowania opieki nad dzieckiem (np. urlop wychowawczy - kod świadczenia/przerwy 121,122; kod tytułu ubezpieczenia 12 11);\n• bezpłatnym udzielonym pracownikom powołanym do pełnienia określonych funkcji z wyboru \noraz\n• stażystów;\n• osób zatrudnionych w celu przygotowania zawodowego;\n• osób wykonujących pracę na podstawie innej niż umowa o pracę np. umowy zlecenia lub \n   umowy  o dzieło lub kontrakt menadżerski;\n• osób współpracujących (za osobę współpracującą w rozumieniu ustawy o systemie \n   ubezpieczeń  społecznych   uważa się małżonka, dzieci własne, dzieci drugiego małżonka i    \n   dzieci  przysposobione, rodziców, macochę i ojczyma oraz osoby przysposabiające, jeżeli \n   pozostają z  osobą prowadzącą działalność gospodarczą we wspólnym gospodarstwie\n   domowym i  współpracują z nią przy prowadzeniu tej działalności);\n• osób skazanych (w czasie odbywania kary pozbawienia wolności lub tymczasowego\n   aresztowania). "]
[null,null,null,null,null,{"$f":"1","v":1},null,{"$f":"VLOOKUP($D$11+1,'Tabela miesiące'!A2:B15,2)","v":"Styczeń_2020"},null,null,{"$f":"IF(B60>0,B60,\"\")","v":""}]
["Liczba miesięcy                  (w przypadku kiedy podmiot działa krócej niż 12 miesięcy wyświetli się faktyczna liczba miesięcy prowadzenia dzialalności)",null,{"$f":"SUM(B62:AI62)","v":0},null,null,{"$f":"1+F12","v":2},null,{"$f":"VLOOKUP($D$11+2,'Tabela miesiące'!A3:B15,2)","v":"Grudzień_2019"},null,null,{"$f":"IF(E60>0,E60,\"\")","v":""}]
[null,null,null,null,null,{"$f":"F13+1","v":3},null,{"$f":"VLOOKUP($D$11+3,'Tabela miesiące'!A$2:B$15,2)","v":"Listopad_2019"},null,null,{"$f":"IF(H60>0,H60,\"\")","v":""}]
[null,null,null,null,null,{"$f":"F14+1","v":4},null,{"$f":"VLOOKUP($D$11+4,'Tabela miesiące'!A$2:B$15,2)","v":"Październik_2019"},null,null,{"$f":"IF(K60>0,K60,\"\")","v":""}]
[null,null,null,null,null,5,null,{"$f":"VLOOKUP($D$11+5,'Tabela miesiące'!A$2:B$15,2)","v":"Wrzesień_2019"},null,null,{"$f":"IF(N60>0,N60,\"\")","v":""}]
[null,null,null,null,null,6,null,{"$f":"VLOOKUP($D$11+6,'Tabela miesiące'!A$2:B$15,2)","v":"Sierpień_2019"},null,null,{"$f":"IF(Q60>0,Q60,\"\")","v":""}]
[null,null,null,null,null,7,null,{"$f":"VLOOKUP($D$11+7,'Tabela miesiące'!A$2:B$15,2)","v":"Lipiec_2019"},null,null,{"$f":"IF(T60>0,T60,\"\")","v":""}]
[null,null,null,null,null,8,null,{"$f":"VLOOKUP($D$11+8,'Tabela miesiące'!A$2:B$15,2)","v":"Czerwiec_2019"},null,null,{"$f":"IF(W60>0,W60,\"\")","v":""}]
[null,null,null,null,null,9,null,{"$f":"VLOOKUP($D$11+9,'Tabela miesiące'!A$2:B$15,2)","v":"Maj_2019"},null,null,{"$f":"IF(Z60>0,Z60,\"\")","v":""}]
[null,null,null,null,null,10,null,{"$f":"VLOOKUP($D$11+10,'Tabela miesiące'!A$2:B$15,2)","v":"Kwiecień_2019"},null,null,{"$f":"IF(AC60>0,AC60,\"\")","v":""}]
[null,null,null,null,null,11,null,{"$f":"VLOOKUP($D$11+11,'Tabela miesiące'!A$2:B$15,2)","v":"Marzec_2019"},null,null,{"$f":"IF(AF60>0,AF60,\"\")","v":""}]
[null,null,null,null,null,12,null,{"$f":"VLOOKUP($D$11+12,'Tabela miesiące'!A$2:B$15,2)","v":"Luty_2019"},null,null,{"$f":"IF(AI60>0,AI60,\"\")","v":""}]
[null,"data rozpoczęcia działalności gospodarczej","(wybierz z listy)",null,null,"Średnia z okresu 12 miesięcy poprzedzajacych miesiąc złożenia wniosku",null,null,null,null,{"$f":"SUM(K12:M23)/C13","v":{"$error":"#DIV/0!"}}]
[]
[]
[{"$f":"H12","v":"Styczeń_2020"},null,null,{"$f":"H13","v":"Grudzień_2019"},null,null,{"$f":"H14","v":"Listopad_2019"},null,null,{"$f":"H15","v":"Październik_2019"},null,null,{"$f":"H16","v":"Wrzesień_2019"},null,null,{"$f":"H17","v":"Sierpień_2019"},null,null,{"$f":"H18","v":"Lipiec_2019"},null,null,{"$f":"H19","v":"Czerwiec_2019"},null,null,{"$f":"H20","v":"Maj_2019"},null,null,{"$f":"H21","v":"Kwiecień_2019"},null,null,{"$f":"H22","v":"Marzec_2019"},null,null,{"$f":"H23","v":"Luty_2019"}]
["Dni w miesiącu","Liczba osób pracujących w poszczególnych dniach miesiąca",null,"Dni w miesiącu","Liczba osób pracujących w poszczególnych dniach miesiąca",null,"Dni w miesiącu","Liczba osób pracujących w poszczególnych dniach miesiąca",null,"Dni w miesiącu","Liczba osób pracujących w poszczególnych dniach miesiąca",null,"Dni w miesiącu","Liczba osób pracujących w poszczególnych dniach miesiąca",null,"Dni w miesiącu","Liczba osób pracujących w poszczególnych dniach miesiąca",null,"Dni w miesiącu","Liczba osób pracujących w poszczególnych dniach miesiąca",null,"Dni w miesiącu","Liczba osób pracujących w poszczególnych dniach miesiąca",null,"Dni w miesiącu","Liczba osób pracujących w poszczególnych dniach miesiąca",null,"Dni w miesiącu","Liczba osób pracujących w poszczególnych dniach miesiąca",null,"Dni w miesiącu","Liczba osób pracujących w poszczególnych dniach miesiąca",null,"Dni w miesiącu","Liczba osób pracujących w poszczególnych dniach miesiąca"]
[1,null,null,1,null,null,1,null,null,1,null,null,1,null,null,1,null,null,1,null,null,1,null,null,1,null,null,1,null,null,1,null,null,1]
[2,null,null,2,null,null,2,null,null,2,null,null,2,null,null,2,null,null,2,null,null,2,null,null,2,null,null,2,null,null,2,null,null,2]
{"$rows_left_out":33}
{"sheet":"instrukcja_obsługi_makr","index":1,"n_rows":274,"n_cols":6,"rows_kept":274,"cut":false,"hidden":false,"merged":[[0,0,0,18],[95,1,95,19],[89,0,89,19],[90,1,90,19],[92,1,92,19],[94,1,94,19],[9,1,9,17]]}
["Uwaga! Poniższy plik zawiera wbudowane makra! \""]
[]
[null,null,null,null,null,"Obsługę pliku Excel zawierającego makra wskazuje poniższa instrukcja:"]
[null,null,null,null,null,"Po zapoznaniu się z instrukcją proszę przejść do zakładki \"szablon_moment_bazowy\""]
[]
[null,null,"Poniżej zostały zamieszczone zrzuty z ekranu, obrazujące prawidłowy sposób pobrania i użytkowania pliku z wbudowanymi makrami."]
[]
[null,"Zrzut nr 1"]
[]
[null,"W przypadku plików z makrami (o rozszerzeniu .xlsm) nie należy wybierać opcji \"Otwórz za pomocą\". \nNależy zaznaczyć pole wyboru „Zapisz plik” i potwierdzić przyciskiem „OK”.Plik zostanie automatycznie zapisany na stacji roboczej użytkownika w folderze „Pobrane”."]
[]
[]
[]
[]
[]
[]
[]
[]
[]
[]
[]
[]
[]
[]
[]
[]
[]
[]
[]
[]
{"$rows_left_out":245}
{"sheet":"Arkusz2","index":2,"n_rows":430,"n_cols":10,"rows_kept":430,"cut":false,"hidden":true,"merged":[]}
[1,"If [h12] = \"Luty_2020\" And [c24] <>","\"","01.03.2019"," \" And [ai29","] >= 1 And [ai30","]>=1 Then","[c24]=",{"$f":"CONCATENATE(C1,D1,\"\"\"\")","v":"\"01.03.2019\""},{"$f":"CONCATENATE(B1,C1,D1,E1,F1,G1)","v":"If [h12] = \"Luty_2020\" And [c24] <>\"01.03.2019 \" And [ai29] >= 1 And [ai30]>=1 Then"}]
[1.1000000000000001,null,null,null,null,null,null,null,null,{"$f":"CONCATENATE(H1,I1)","v":"[c24]=\"01.03.2019\""}]
[1.2,null,null,null,null,null,null,null,null,"End If"]
[2,"If [h12] = \"Luty_2020\" And [c24] <>","\"","02.03.2019"," \" And [ai30","] >= 1 And [ai29","]=\"\" Then","[c24]=",{"$f":"CONCATENATE(C4,D4,\"\"\"\")","v":"\"02.03.2019\""},{"$f":"CONCATENATE(B4,C4,D4,E4,F4,G4)","v":"If [h12] = \"Luty_2020\" And [c24] <>\"02.03.2019 \" And [ai30] >= 1 And [ai29]=\"\" Then"}]
[2.1,null,null,null,null,null,null,null,null,{"$f":"CONCATENATE(H4,I4)","v":"[c24]=\"02.03.2019\""}]
[2.2000000000000002,null,null,null,null,null,null,null,null,"End If"]
[3,"If [h12] = \"Luty_2020\" And [c24] <>","\"","03.03.2019"," \" And [ai31","] >= 1 And [ai32","]=\"\" Then","[c24]=",{"$f":"CONCATENATE(C7,D7,\"\"\"\")","v":"\"03.03.2019\""},{"$f":"CONCATENATE(B7,C7,D7,E7,F7,G7)","v":"If [h12] = \"Luty_2020\" And [c24] <>\"03.03.2019 \" And [ai31] >= 1 And [ai32]=\"\" Then"}]
[3.1,null,null,null,null,null,null,null,null,{"$f":"CONCATENATE(H7,I7)","v":"[c24]=\"03.03.2019\""}]
[3.2,null,null,null,null,null,null,null,null,"End If"]
[4,"If [h12] = \"Luty_2020\" And [c24] <>","\"","04.03.2019"," \" And [ai32","] >= 1 And [ai33","]=\"\" Then","[c24]=",{"$f":"CONCATENATE(C10,D10,\"\"\"\")","v":"\"04.03.2019\""},{"$f":"CONCATENATE(B10,C10,D10,E10,F10,G10)","v":"If [h12] = \"Luty_2020\" And [c24] <>\"04.03.2019 \" And [ai32] >= 1 And [ai33]=\"\" Then"}]
[4.0999999999999996,null,null,null,null,null,null,null,null,{"$f":"CONCATENATE(H10,I10)","v":"[c24]=\"04.03.2019\""}]
[4.2,null,null,null,null,null,null,null,null,"End If"]
[5,"If [h12] = \"Luty_2020\" And [c24] <>","\"","05.03.2019"," \" And [ai33","] >= 1 And [ai34","]=\"\" Then","[c24]=",{"$f":"CONCATENATE(C13,D13,\"\"\"\")","v":"\"05.03.2019\""},{"$f":"CONCATENATE(B13,C13,D13,E13,F13,G13)","v":"If [h12] = \"Luty_2020\" And [c24] <>\"05.03.2019 \" And [ai33] >= 1 And [ai34]=\"\" Then"}]
[5.0999999999999996,null,null,null,null,null,null,null,null,{"$f":"CONCATENATE(H13,I13)","v":"[c24]=\"05.03.2019\""}]
[5.2,null,null,null,null,null,null,null,null,"End If"]
[6,"If [h12] = \"Luty_2020\" And [c24] <>","\"","06.03.2019"," \" And [ai34","] >= 1 And [ai35","]=\"\" Then","[c24]=",{"$f":"CONCATENATE(C16,D16,\"\"\"\")","v":"\"06.03.2019\""},{"$f":"CONCATENATE(B16,C16,D16,E16,F16,G16)","v":"If [h12] = \"Luty_2020\" And [c24] <>\"06.03.2019 \" And [ai34] >= 1 And [ai35]=\"\" Then"}]
[6.1,null,null,null,null,null,null,null,null,{"$f":"CONCATENATE(H16,I16)","v":"[c24]=\"06.03.2019\""}]
[6.2,null,null,null,null,null,null,null,null,"End If"]
[7,"If [h12] = \"Luty_2020\" And [c24] <>","\"","07.03.2019"," \" And [ai35","] >= 1 And [ai36","]=\"\" Then","[c24]=",{"$f":"CONCATENATE(C19,D19,\"\"\"\")","v":"\"07.03.2019\""},{"$f":"CONCATENATE(B19,C19,D19,E19,F19,G19)","v":"If [h12] = \"Luty_2020\" And [c24] <>\"07.03.2019 \" And [ai35] >= 1 And [ai36]=\"\" Then"}]
[7.1,null,null,null,null,null,null,null,null,{"$f":"CONCATENATE(H19,I19)","v":"[c24]=\"07.03.2019\""}]
[7.2,null,null,null,null,null,null,null,null,"End If"]
[8,"If [h12] = \"Luty_2020\" And [c24] <>","\"","08.03.2019"," \" And [ai36","] >= 1 And [ai37","]=\"\" Then","[c24]=",{"$f":"CONCATENATE(C22,D22,\"\"\"\")","v":"\"08.03.2019\""},{"$f":"CONCATENATE(B22,C22,D22,E22,F22,G22)","v":"If [h12] = \"Luty_2020\" And [c24] <>\"08.03.2019 \" And [ai36] >= 1 And [ai37]=\"\" Then"}]
[8.1,null,null,null,null,null,null,null,null,{"$f":"CONCATENATE(H22,I22)","v":"[c24]=\"08.03.2019\""}]
[8.1999999999999993,null,null,null,null,null,null,null,null,"End If"]
[9,"If [h12] = \"Luty_2020\" And [c24] <>","\"","09.03.2019"," \" And [ai37","] >= 1 And [ai38","]=\"\" Then","[c24]=",{"$f":"CONCATENATE(C25,D25,\"\"\"\")","v":"\"09.03.2019\""},{"$f":"CONCATENATE(B25,C25,D25,E25,F25,G25)","v":"If [h12] = \"Luty_2020\" And [c24] <>\"09.03.2019 \" And [ai37] >= 1 And [ai38]=\"\" Then"}]
[9.1,null,null,null,null,null,null,null,null,{"$f":"CONCATENATE(H25,I25)","v":"[c24]=\"09.03.2019\""}]
[9.1999999999999993,null,null,null,null,null,null,null,null,"End If"]
[10,"If [h12] = \"Luty_2020\" And [c24] <>","\"","10.03.2019"," \" And [ai38","] >= 1 And [ai39","]=\"\" Then","[c24]=",{"$f":"CONCATENATE(C28,D28,\"\"\"\")","v":"\"10.03.2019\""},{"$f":"CONCATENATE(B28,C28,D28,E28,F28,G28)","v":"If [h12] = \"Luty_2020\" And [c24] <>\"10.03.2019 \" And [ai38] >= 1 And [ai39]=\"\" Then"}]
[10.1,null,null,null,null,null,null,null,null,{"$f":"CONCATENATE(H28,I28)","v":"[c24]=\"10.03.2019\""}]
[10.199999999999999,null,null,null,null,null,null,null,null,"End If"]
{"$rows_left_out":401}
{"sheet":"miesiące_2","index":3,"n_rows":368,"n_cols":6,"rows_kept":368,"cut":false,"hidden":true,"merged":[]}
[null,null,"Marzec_2020","Luty_2020"]
[null,{"$f":"IF(szablon_moment_bazowy!$H$12=\"Styczeń_2020\",miesiące_2!D2,C2)","v":"(wybierz z listy)"},"(wybierz z listy)","(wybierz z listy)"]
[null,{"$f":"IF(szablon_moment_bazowy!$H$12=\"Styczeń_2020\",miesiące_2!D3,C3)","v":"2019-02-01"},"2019-03-01","2019-02-01",null,{"$f":"TEXT(C3,\"dd.mm.rrrrr\")","v":"01.03.2019"}]
[null,{"$f":"IF(szablon_moment_bazowy!$H$12=\"Styczeń_2020\",miesiące_2!D4,C4)","v":"2019-02-02"},"2019-03-02","2019-02-02",null,{"$f":"TEXT(C4,\"dd.mm.rrrrr\")","v":"02.03.2019"}]
[null,{"$f":"IF(szablon_moment_bazowy!$H$12=\"Styczeń_2020\",miesiące_2!D5,C5)","v":"2019-02-03"},"2019-03-03","2019-02-03",null,"03.03.2019"]
[null,{"$f":"IF(szablon_moment_bazowy!$H$12=\"Styczeń_2020\",miesiące_2!D6,C6)","v":"2019-02-04"},"2019-03-04","2019-02-04",null,"04.03.2019"]
[null,{"$f":"IF(szablon_moment_bazowy!$H$12=\"Styczeń_2020\",miesiące_2!D7,C7)","v":"2019-02-05"},"2019-03-05","2019-02-05",null,"05.03.2019"]
[null,{"$f":"IF(szablon_moment_bazowy!$H$12=\"Styczeń_2020\",miesiące_2!D8,C8)","v":"2019-02-06"},"2019-03-06","2019-02-06",null,"06.03.2019"]
[null,{"$f":"IF(szablon_moment_bazowy!$H$12=\"Styczeń_2020\",miesiące_2!D9,C9)","v":"2019-02-07"},"2019-03-07","2019-02-07",null,"07.03.2019"]
[null,{"$f":"IF(szablon_moment_bazowy!$H$12=\"Styczeń_2020\",miesiące_2!D10,C10)","v":"2019-02-08"},"2019-03-08","2019-02-08",null,"08.03.2019"]
[null,{"$f":"IF(szablon_moment_bazowy!$H$12=\"Styczeń_2020\",miesiące_2!D11,C11)","v":"2019-02-09"},"2019-03-09","2019-02-09",null,"09.03.2019"]
[null,{"$f":"IF(szablon_moment_bazowy!$H$12=\"Styczeń_2020\",miesiące_2!D12,C12)","v":"2019-02-10"},"2019-03-10","2019-02-10",null,"10.03.2019"]
[null,{"$f":"IF(szablon_moment_bazowy!$H$12=\"Styczeń_2020\",miesiące_2!D13,C13)","v":"2019-02-11"},"2019-03-11","2019-02-11",null,"11.03.2019"]
[null,{"$f":"IF(szablon_moment_bazowy!$H$12=\"Styczeń_2020\",miesiące_2!D14,C14)","v":"2019-02-12"},"2019-03-12","2019-02-12",null,"12.03.2019"]
[null,{"$f":"IF(szablon_moment_bazowy!$H$12=\"Styczeń_2020\",miesiące_2!D15,C15)","v":"2019-02-13"},"2019-03-13","2019-02-13",null,"13.03.2019"]
[null,{"$f":"IF(szablon_moment_bazowy!$H$12=\"Styczeń_2020\",miesiące_2!D16,C16)","v":"2019-02-14"},"2019-03-14","2019-02-14",null,"14.03.2019"]
[null,{"$f":"IF(szablon_moment_bazowy!$H$12=\"Styczeń_2020\",miesiące_2!D17,C17)","v":"2019-02-15"},"2019-03-15","2019-02-15",null,"15.03.2019"]
[null,{"$f":"IF(szablon_moment_bazowy!$H$12=\"Styczeń_2020\",miesiące_2!D18,C18)","v":"2019-02-16"},"2019-03-16","2019-02-16",null,"16.03.2019"]
[null,{"$f":"IF(szablon_moment_bazowy!$H$12=\"Styczeń_2020\",miesiące_2!D19,C19)","v":"2019-02-17"},"2019-03-17","2019-02-17",null,"17.03.2019"]
[null,{"$f":"IF(szablon_moment_bazowy!$H$12=\"Styczeń_2020\",miesiące_2!D20,C20)","v":"2019-02-18"},"2019-03-18","2019-02-18",null,"18.03.2019"]
[null,{"$f":"IF(szablon_moment_bazowy!$H$12=\"Styczeń_2020\",miesiące_2!D21,C21)","v":"2019-02-19"},"2019-03-19","2019-02-19",null,"19.03.2019"]
[null,{"$f":"IF(szablon_moment_bazowy!$H$12=\"Styczeń_2020\",miesiące_2!D22,C22)","v":"2019-02-20"},"2019-03-20","2019-02-20",null,"20.03.2019"]
[null,{"$f":"IF(szablon_moment_bazowy!$H$12=\"Styczeń_2020\",miesiące_2!D23,C23)","v":"2019-02-21"},"2019-03-21","2019-02-21",null,"21.03.2019"]
[null,{"$f":"IF(szablon_moment_bazowy!$H$12=\"Styczeń_2020\",miesiące_2!D24,C24)","v":"2019-02-22"},"2019-03-22","2019-02-22",null,"22.03.2019"]
[null,{"$f":"IF(szablon_moment_bazowy!$H$12=\"Styczeń_2020\",miesiące_2!D25,C25)","v":"2019-02-23"},"2019-03-23","2019-02-23",null,"23.03.2019"]
[null,{"$f":"IF(szablon_moment_bazowy!$H$12=\"Styczeń_2020\",miesiące_2!D26,C26)","v":"2019-02-24"},"2019-03-24","2019-02-24",null,"24.03.2019"]
[null,{"$f":"IF(szablon_moment_bazowy!$H$12=\"Styczeń_2020\",miesiące_2!D27,C27)","v":"2019-02-25"},"2019-03-25","2019-02-25",null,"25.03.2019"]
[null,{"$f":"IF(szablon_moment_bazowy!$H$12=\"Styczeń_2020\",miesiące_2!D28,C28)","v":"2019-02-26"},"2019-03-26","2019-02-26",null,"26.03.2019"]
[null,{"$f":"IF(szablon_moment_bazowy!$H$12=\"Styczeń_2020\",miesiące_2!D29,C29)","v":"2019-02-27"},"2019-03-27","2019-02-27",null,"27.03.2019"]
[null,{"$f":"IF(szablon_moment_bazowy!$H$12=\"Styczeń_2020\",miesiące_2!D30,C30)","v":"2019-02-28"},"2019-03-28","2019-02-28",null,"28.03.2019"]
{"$rows_left_out":339}
{"sheet":"Tabela miesiące","index":4,"n_rows":367,"n_cols":12,"rows_kept":367,"cut":false,"hidden":true,"merged":[]}
["LP.","Miesiąc","Liczba dni",null,null,null,null,"Marzec_2020",null,"Marzec 2019","Kwiecień 2019","Maj 2019"]
[1,"Marzec_2020",31,null,null,null,null,"2019-03-01",null,"2019-03-01","2019-04-01","2019-05-01"]
[2,"Luty_2020",29,null,null,null,null,"2019-03-02",null,"2019-03-02","2019-04-02","2019-05-02"]
[3,"Styczeń_2020",31,null,null,null,null,"2019-03-03",null,"2019-03-03","2019-04-03","2019-05-03"]
[4,"Grudzień_2019",31,null,null,null,null,"2019-03-04",null,"2019-03-04","2019-04-04","2019-05-04"]
[5,"Listopad_2019",30,null,null,null,null,"2019-03-05",null,"2019-03-05","2019-04-05","2019-05-05"]
[6,"Październik_2019",31,null,null,null,null,"2019-03-06",null,"2019-03-06","2019-04-06","2019-05-06"]
[7,"Wrzesień_2019",30,null,null,null,null,"2019-03-07",null,"2019-03-07","2019-04-07","2019-05-07"]
[8,"Sierpień_2019",31,null,null,null,null,"2019-03-08",null,"2019-03-08","2019-04-08","2019-05-08"]
[9,"Lipiec_2019",31,null,null,null,null,"2019-03-09",null,"2019-03-09","2019-04-09","2019-05-09"]
[10,"Czerwiec_2019",30,null,null,null,null,"2019-03-10",null,"2019-03-10","2019-04-10","2019-05-10"]
[11,"Maj_2019",31,null,null,null,null,"2019-03-11",null,"2019-03-11","2019-04-11","2019-05-11"]
[12,"Kwiecień_2019",30,null,null,null,null,"2019-03-12",null,"2019-03-12","2019-04-12","2019-05-12"]
[13,"Marzec_2019",31,null,null,null,null,"2019-03-13",null,"2019-03-13","2019-04-13","2019-05-13"]
[14,"Luty_2019",28,null,null,null,null,"2019-03-14",null,"2019-03-14","2019-04-14","2019-05-14"]
[null,null,null,null,null,null,null,"2019-03-15",null,"2019-03-15","2019-04-15","2019-05-15"]
[null,null,null,null,null,null,null,"2019-03-16",null,"2019-03-16","2019-04-16","2019-05-16"]
[null,null,null,null,null,null,null,"2019-03-17",null,"2019-03-17","2019-04-17","2019-05-17"]
[null,null,null,null,null,null,null,"2019-03-18",null,"2019-03-18","2019-04-18","2019-05-18"]
[null,null,null,null,null,null,null,"2019-03-19",null,"2019-03-19","2019-04-19","2019-05-19"]
[null,null,null,null,null,null,null,"2019-03-20",null,"2019-03-20","2019-04-20","2019-05-20"]
[null,null,null,null,null,null,null,"2019-03-21",null,"2019-03-21","2019-04-21","2019-05-21"]
[null,null,null,null,null,null,null,"2019-03-22",null,"2019-03-22","2019-04-22","2019-05-22"]
[null,null,null,null,null,null,null,"2019-03-23",null,"2019-03-23","2019-04-23","2019-05-23"]
[null,null,null,null,null,null,null,"2019-03-24",null,"2019-03-24","2019-04-24","2019-05-24"]
[null,null,null,null,null,null,null,"2019-03-25",null,"2019-03-25","2019-04-25","2019-05-25"]
[null,null,null,null,null,null,null,"2019-03-26",null,"2019-03-26","2019-04-26","2019-05-26"]
[null,null,null,null,null,null,null,"2019-03-27",null,"2019-03-27","2019-04-27","2019-05-27"]
[null,null,null,null,null,null,null,"2019-03-28",null,"2019-03-28","2019-04-28","2019-05-28"]
[null,null,null,null,null,null,null,"2019-03-29",null,"2019-03-29","2019-04-29","2019-05-29"]
{"$rows_left_out":337}