{"text_format":"1","workbook":"xlsx","n_sheets":14,"sheets":["Wniosek","Weryfikacja 1","Weryfikacja 2","Weryfikacja 3","Operatorzy","Dane zbiorcze","Do wniosku","Dane - linie (1)","Dane - linie (2)","Dane - linie (3)","Linie - kwartał","MiR","Dane JST","Miesiące"],"not_rendered":{"charts":0,"images":2,"macros":1,"external_links":0,"defined_names":412,"comments":0,"pivot_tables":0},"unopened":[],"bounds":{"document_bytes":16777216,"sheet_cells":100000,"rows_first":2000,"rows_last":500,"rows_between":2000,"halvings":0,"cell_chars":16384,"cell_head_chars":4096},"cells_cut":0,"cells_raw":0,"read":"whole","date_system":"1900"}

{"sheet":"Wniosek","index":0,"n_rows":547,"n_cols":9,"rows_kept":547,"cut":false,"hidden":false,"merged":[[32,7,32,8],[128,7,128,8],[129,7,129,8],[130,7,130,8],[131,7,131,8],[132,7,132,8],[133,7,133,8],[134,7,134,8],[119,7,119,8],[120,7,120,8],[121,7,121,8],[122,7,122,8],[123,7,123,8],[124,7,124,8],[116,7,116,8],[117,7,117,8],[118,7,118,8],[60,7,60,8],[61,7,61,8],[62,7,62,8],[63,7,63,8],[64,7,64,8],[65,7,65,8],[137,7,137,8],[138,7,138,8],[144,7,144,8],[145,7,145,8],[146,7,146,8],[147,7,147,8],[135,7,135,8],[136,7,136,8],[33,7,33,8],[75,7,75,8],[51,7,51,8],[52,7,52,8],[53,7,53,8],[54,7,54,8],[55,7,55,8],[56,7,56,8],[57,7,57,8],[58,7,58,8],[59,7,59,8],[66,7,66,8],[67,7,67,8],[68,7,68,8],[69,7,69,8],[70,7,70,8],[71,7,71,8],[72,7,72,8],[73,7,73,8],[74,7,74,8],[34,7,34,8],[35,7,35,8],[36,7,36,8],[37,7,37,8],[38,7,38,8],[39,7,39,8],[40,7,40,8],[41,7,41,8],[42,7,42,8],[47,7,47,8],[48,7,48,8],[49,7,49,8],[50,7,50,8],[41,1,41,4],[42,1,42,4],[43,1,43,4],[48,1,48,4],[49,1,49,4],[50,1,50,4],[45,1,45,4],[46,1,46,4],[47,1,47,4],[0,5,0,7],[529,0,529,8],[10,1,10,2],[163,0,163,8],[21,0,21,8],[25,6,25,8],[1,6,1,8],[282,0,282,1],[29,0,29,8],[2,1,2,2],[23,6,23,8],[23,1,23,5],[19,0,19,8],[17,0,18,3],[27,6,27,8],[24,6,24,8],[26,6,26,8],[151,7,151,8],[152,1,152,4],[134,1,134,4],[43,7,43,8],[44,7,44,8],[45,7,45,8],[46,7,46,8],[75,1,75,4],[76,1,76,4],[77,1,77,4],[78,1,78,4],[79,1,79,4],[66,1,66,4],[67,1,67,4],[152,7,152,8],[133,1,133,4],[98,7,98,8],[99,7,99,8],[100,7,100,8],[101,7,101,8],[102,7,102,8],[103,7,103,8],[104,7,104,8],[105,7,105,8],[106,7,106,8],[125,7,125,8],[126,7,126,8],[127,7,127,8],[110,7,110,8],[111,7,111,8],[112,7,112,8],[82,1,82,4],[83,1,83,4],[99,1,99,4],[100,1,100,4],[93,1,93,4],[533,0,533,4],[533,5,533,6],[534,5,534,6],[144,1,144,4],[128,1,128,4],[129,1,129,4],[130,1,130,4],[131,1,131,4],[132,1,132,4],[109,1,109,4],[110,1,110,4],[94,1,94,4],[95,1,95,4],[96,1,96,4],[97,1,97,4],[98,1,98,4],[101,1,101,4],[155,1,155,4],[135,1,135,4],[125,1,125,4],[126,1,126,4],[127,1,127,4],[540,3,540,7],[84,1,84,4],[85,1,85,4],[86,1,86,4],[87,1,87,4],[88,1,88,4],[89,1,89,4],[90,1,90,4],[91,1,91,4],[92,1,92,4],[103,1,103,4],[104,1,104,4],[105,1,105,4],[106,1,106,4],[107,1,107,4],[108,1,108,4],[145,1,145,4],[535,0,535,6],[113,7,113,8],[114,7,114,8],[115,7,115,8],[547,0,547,8],[537,3,538,7],[541,3,542,7],[147,1,147,4],[148,1,148,4],[285,3,285,4],[285,5,285,8],[403,0,403,1],[403,5,403,6],[405,0,405,8],[406,0,406,2],[406,3,406,4],[406,5,406,8],[524,0,524,1],[524,5,524,6],[526,0,526,8],[284,0,284,8],[150,0,150,8],[151,1,151,4],[151,5,151,6],[532,0,532,4],[154,1,154,4],[154,5,154,6],[154,7,154,8],[36,1,36,4],[152,5,152,6],[17,5,18,8],[26,1,26,5],[27,1,27,5],[24,1,24,5],[25,1,25,5],[34,1,34,4],[35,1,35,4],[22,1,22,5],[22,6,22,8],[31,0,31,8],[32,1,32,4],[33,1,33,4],[28,1,28,5],[28,6,28,8],[37,1,37,4],[38,1,38,4],[39,1,39,4],[44,1,44,4],[40,1,40,4],[146,1,146,4],[137,1,137,4],[124,1,124,4],[51,1,51,4],[52,1,52,4],[53,1,53,4],[54,1,54,4],[55,1,55,4],[56,1,56,4],[57,1,57,4],[80,1,80,4],[81,1,81,4],[58,1,58,4],[59,1,59,4],[60,1,60,4],[61,1,61,4],[62,1,62,4],[63,1,63,4],[64,1,64,4],[65,1,65,4],[68,1,68,4],[69,1,69,4],[70,1,70,4],[71,1,71,4],[72,1,72,4],[73,1,73,4],[74,1,74,4],[76,7,76,8],[77,7,77,8],[78,7,78,8],[79,7,79,8],[89,7,89,8],[90,7,90,8],[91,7,91,8],[92,7,92,8],[93,7,93,8],[94,7,94,8],[95,7,95,8],[80,7,80,8],[81,7,81,8],[82,7,82,8],[83,7,83,8],[84,7,84,8],[85,7,85,8],[86,7,86,8],[87,7,87,8],[88,7,88,8],[96,7,96,8],[97,7,97,8],[107,7,107,8],[108,7,108,8],[109,7,109,8],[153,1,153,4],[153,5,153,6],[153,7,153,8],[120,1,120,4],[121,1,121,4],[122,1,122,4],[123,1,123,4],[111,1,111,4],[112,1,112,4],[113,1,113,4],[114,1,114,4],[115,1,115,4],[116,1,116,4],[117,1,117,4],[118,1,118,4],[119,1,119,4],[136,1,136,4],[138,1,138,4],[102,1,102,4],[546,0,546,1],[157,1,157,4],[157,5,157,6],[157,7,157,8],[158,1,158,4],[158,5,158,6],[158,7,158,8],[161,1,161,4],[161,5,161,6],[161,7,161,8],[159,1,159,4],[159,5,159,6],[159,7,159,8],[160,1,160,4],[160,5,160,6],[160,7,160,8],[545,2,545,4],[539,3,539,7],[534,0,534,4],[530,0,530,8],[164,3,164,4],[164,5,164,8],[164,0,164,2],[282,5,282,6],[155,5,155,6],[155,7,155,8],[156,1,156,4],[156,5,156,6],[156,7,156,8],[527,3,528,7],[285,0,285,2],[544,1,544,2],[139,7,139,8],[140,7,140,8],[141,7,141,8],[142,7,142,8],[143,7,143,8],[139,1,139,4],[140,1,140,4],[141,1,141,4],[142,1,142,4],[143,1,143,4],[148,7,148,8]]}
[{"$f":"IF(G25=\"\",\"\",G24&\"#\"&ROUND(H536,2)&\"#\"&C4&\"#\")","v":""}]
[null,null,null,null,null,null,"          (miejscowość, data)"]
[null,"A1. ORGANIZATOR PUBLICZNEGO TRANSPORTU ZBIOROWEGO\n(dane wypełnią się automatycznie po wpisaniu poprawnego numeru umowy w części A.3)"]
[null,"Nazwa organizatora publicznego transportu zbiorowego",{"$f":"IFERROR(VLOOKUP($G$24,Tabela2[[Nr umowy]:[nazwa]],4,0),\"Proszę wybrać nr umowy z listy rozwijanej w pkt 1 cz. A.3\")","v":"Proszę wybrać nr umowy z listy rozwijanej w pkt 1 cz. A.3"}]
[null,"NIP",{"$f":"IFERROR(VLOOKUP($G$24,Tabela2[[Nr umowy]:[nazwa]],2,0),\"Proszę wybrać nr umowy z listy rozwijanej\")","v":"Proszę wybrać nr umowy z listy rozwijanej"}]
[null,"REGON",{"$f":"IFERROR(VLOOKUP($G$24,Tabela2[[Nr umowy]:[nazwa]],3,0),\"Proszę wybrać nr umowy z listy rozwijanej\")","v":"Proszę wybrać nr umowy z listy rozwijanej"}]
[null,"Adres",{"$f":"IFERROR(VLOOKUP($G$24,Tabela2[[Nr umowy]:[Adres]],5,0),\"Proszę wybrać nr umowy z listy rozwijanej\")","v":"Proszę wybrać nr umowy z listy rozwijanej"}]
[null,"Powiat",{"$f":"IFERROR(VLOOKUP($G$24,Tabela2[[Nr umowy]:[Powiat]],7,0),\"Proszę wybrać nr umowy z listy rozwijanej\")","v":"Proszę wybrać nr umowy z listy rozwijanej"}]
[null,"Województwo","mazowieckie"]
[null,"Numer dysponenta",{"$f":"IFERROR(VLOOKUP(G24,Tabela2[[Nr umowy]:[Dysponent]],8,0),\"Proszę wybrać nr umowy z listy rozwijanej\")","v":"Proszę wybrać nr umowy z listy rozwijanej"}]
[null,"A2. Dane osoby do kontaktu w sprawie wniosku"]
[null,"Imię"]
[null,"Nazwisko"]
[null,"Telefon "]
[null,"Adres e-mail"]
[]
[null,null,null,null,"Wojewoda Mazowiecki\nWydział Infrastruktury i Rolnictwa\npl. Bankowy 3/5\n00-950 Warszawa"]
["ZALICZKOWY WNIOSEK  O DOPŁATĘ W OKRESIE ROZLICZENIOWYM ZA ",null,null,null,null," 2026 ROKU DO REALIZACJI ZADAŃ WŁASNYCH  ORGANIZATORA"]
[null,null,null,null,"I KWARTAŁ"]
[" W ZAKRESIE PRZEWOZÓW AUTOBUSOWYCH O CHARAKTERZE UŻYTECZNOŚCI  PUBLICZNEJ PRZEZ DOPŁATĘ DO CENY USŁUGI"]
[]
["A.3  Informacje dotyczące organizatora publicznego transportu zbiorowego"]
["0.","Rodzaj wniosku (w przypadku korekty w polu \"uwagi\" opisać zakres korygowanych wartości)"]
["1.","Numer umowy o dopłatę "]
["2.","Data zawarcia umowy o dopłatę",null,null,null,null,{"$f":"IFERROR(VLOOKUP(G24,'Dane JST'!$A$2:$I$172,9,0),\"\")","v":""}]
["3.","Kwota niewykorzystanych środków Funduszu  z rozliczenia poprzedniego kwartału (nie dotyczy wniosku za I kwartał) (zł)"]
["4.","Przewidywane zapotrzebowanie środków z Funduszu na realizację zadań objętych umową w kolejnym okresie rozliczeniowym (dotyczy wniosków za I, II i III kwartał) (zł)"]
["5.","Liczba operatorów publicznego transportu zbiorowego"]
["6.","Liczba linii komunikacyjnych na które organizator występuje o dopłatę w okresie rozliczeniowym"]
["*niepotrzebne skreślić"]
[]
["A.4  Dane dotyczące uruchomienia linii komunikacyjnych"]
["Lp.","Nazwa linii komunikacyjnej",null,null,null,"Data uruchomienia linii komunikacyjnej wskazana we wniosku o objęcie dopłatą.","Data uruchomienia linii komunikacyjnej."]
[null,1,null,null,null,"2","3"]
[1,null,null,null,null,null,null,{"$f":"IF(G35>F35,\"linia nie podlega dopłacie-art. 11e\",\"\")","v":""}]
[2,null,null,null,null,null,null,{"$f":"IF(G36>F36,\"linia nie podlega dopłacie-art. 11e\",\"\")","v":""}]
[3,null,null,null,null,null,null,""]
[4,null,null,null,null,null,null,""]
[5,null,null,null,null,null,null,""]
[6,null,null,null,null,null,null,""]
[7,null,null,null,null,null,null,""]
[8,null,null,null,null,null,null,""]
[9,null,null,null,null,null,null,""]
[10,null,null,null,null,null,null,""]
[11,null,null,null,null,null,null,""]
[12,null,null,null,null,null,null,""]
[13,null,null,null,null,null,null,""]
[14,null,null,null,null,null,null,""]
[15,null,null,null,null,null,null,""]
[16,null,null,null,null,null,null,""]
[17,null,null,null,null,null,null,""]
[18,null,null,null,null,null,null,""]
[19,null,null,null,null,null,null,""]
[20,null,null,null,null,null,null,""]
[21,null,null,null,null,null,null,""]
[22,null,null,null,null,null,null,""]
[23,null,null,null,null,null,null,""]
[24,null,null,null,null,null,null,""]
[25,null,null,null,null,null,null,""]
[26,null,null,null,null,null,null,""]
[27,null,null,null,null,null,null,""]
[28,null,null,null,null,null,null,""]
[29,null,null,null,null,null,null,""]
[30,null,null,null,null,null,null,""]
[31,null,null,null,null,null,null,""]
[32,null,null,null,null,null,null,""]
[33,null,null,null,null,null,null,""]
[34,null,null,null,null,null,null,""]
[35,null,null,null,null,null,null,""]
[36,null,null,null,null,null,null,""]
[37,null,null,null,null,null,null,""]
[38,null,null,null,null,null,null,""]
[39,null,null,null,null,null,null,""]
[40,null,null,null,null,null,null,""]
[41,null,null,null,null,null,null,""]
[42,null,null,null,null,null,null,""]
[43,null,null,null,null,null,null,""]
[44,null,null,null,null,null,null,""]
[45,null,null,null,null,null,null,""]
[46,null,null,null,null,null,null,""]
[47,null,null,null,null,null,null,""]
[48,null,null,null,null,null,null,""]
[49,null,null,null,null,null,null,""]
[50,null,null,null,null,null,null,""]
[51,null,null,null,null,null,null,""]
[52,null,null,null,null,null,null,""]
[53,null,null,null,null,null,null,""]
[54,null,null,null,null,null,null,""]
[55,null,null,null,null,null,null,""]
[56,null,null,null,null,null,null,""]
[57,null,null,null,null,null,null,""]
[58,null,null,null,null,null,null,""]
[59,null,null,null,null,null,null,""]
[60,null,null,null,null,null,null,""]
[61,null,null,null,null,null,null,""]
[62,null,null,null,null,null,null,""]
[63,null,null,null,null,null,null,""]
[64,null,null,null,null,null,null,""]
[65,null,null,null,null,null,null,""]
[66,null,null,null,null,null,null,{"$f":"IF(G100>F100,\"linia nie podlega dopłacie-art. 11e\",\"\")","v":""}]
[67,null,null,null,null,null,null,""]
[68,null,null,null,null,null,null,""]
[69,null,null,null,null,null,null,""]
[70,null,null,null,null,null,null,""]
[71,null,null,null,null,null,null,""]
[72,null,null,null,null,null,null,""]
[73,null,null,null,null,null,null,""]
[74,null,null,null,null,null,null,""]
[75,null,null,null,null,null,null,""]
[76,null,null,null,null,null,null,""]
[77,null,null,null,null,null,null,""]
[78,null,null,null,null,null,null,""]
[79,null,null,null,null,null,null,""]
[80,null,null,null,null,null,null,""]
[81,null,null,null,null,null,null,""]
[82,null,null,null,null,null,null,""]
[83,null,null,null,null,null,null,""]
[84,null,null,null,null,null,null,""]
[85,null,null,null,null,null,null,""]
[86,null,null,null,null,null,null,""]
[87,null,null,null,null,null,null,""]
[88,null,null,null,null,null,null,""]
[89,null,null,null,null,null,null,""]
[90,null,null,null,null,null,null,""]
[91,null,null,null,null,null,null,""]
[92,null,null,null,null,null,null,""]
[93,null,null,null,null,null,null,""]
[94,null,null,null,null,null,null,""]
[95,null,null,null,null,null,null,""]
[96,null,null,null,null,null,null,""]
[97,null,null,null,null,null,null,""]
[98,null,null,null,null,null,null,""]
[99,null,null,null,null,null,null,""]
[100,null,null,null,null,null,null,""]
[101,null,null,null,null,null,null,""]
[102,null,null,null,null,null,null,""]
[103,null,null,null,null,null,null,""]
[104,null,null,null,null,null,null,""]
[105,null,null,null,null,null,null,""]
[106,null,null,null,null,null,null,""]
[107,null,null,null,null,null,null,""]
[108,null,null,null,null,null,null,""]
[109,null,null,null,null,null,null,""]
[110,null,null,null,null,null,null,""]
[111,null,null,null,null,null,null,""]
[112,null,null,null,null,null,null,""]
[113,null,null,null,null,null,null,""]
[114,null,null,null,null,null,null,""]
[115,null,null,null,null,null,null,""]
[]
["B.1  Dane dotyczące operatorów publicznego transportu zbiorowego"]
["Lp.","Nazwa operatora publicznego transportu zbiorowego",null,null,null,"NIP",null,"REGON"]
[1]
[2]
[3,null,null,null,null,null,null,""]
[4,null,null,null,null,null,null,""]
[5,null,null,null,null,null,null,""]
[6,"",null,null,null,null,null,""]
[7,"",null,null,null,null,null,""]
[8,"",null,null,null,null,null,""]
[9,"",null,null,null,null,null,""]
[10,""]
[]
["B.2  Dane dotyczące linii komunikacyjnych "]
["MIESIĄC",null,null,{"$f":"IF(E19=\"I KWARTAŁ\",\"STYCZEŃ\",IF(E19=\"II KWARTAŁ\",\"KWIECIEŃ\",IF(E19=\"III KWARTAŁ\",\"LIPIEC\",IF(E19=\"IV KWARTAŁ\",\"PAŹDZIERNIK\",\"\"))))","v":"STYCZEŃ"},null,"2026 r."]
["Lp.","Nazwa linii komunikacyjnej","Przewidywana wielkość pracy eksploatacyjnej w okresie rozliczeniowym [wzkm]","Cena usługi [zł]","Planowany deficyt w okresie rozliczeniowym [zł]","Część ceny usługi sfinansowana ze środków własnych organizatora \n[zł/wzkm]","Procentowa wartość części ceny usługi sfinansowanej ze środków własnych organizatora [%]","Kwota środków własnych organizatora [zł]","Kwota dopłaty \nw okresie rozliczeniowym \n[zł]"]
[null,1,2,3,4,5,6,7,8]
[{"$f":"A35","v":1},{"$f":"IF(B35=\"\",\"\",B35)","v":""},null,{"$f":"IFERROR(E168/C168,0)","v":0},null,{"$f":"IFERROR(H168/C168,0)","v":0},{"$f":"IFERROR(F168/D168,0)","v":0},null,{"$f":"IF(H35=\"linia nie podlega dopłacie-art. 11e\",0,'Weryfikacja 1'!S3)","v":0}]
[{"$f":"A36","v":2},{"$f":"IF(B36=\"\",\"\",B36)","v":""},null,{"$f":"IFERROR(E169/C169,0)","v":0},null,{"$f":"IFERROR(H169/C169,0)","v":0},{"$f":"IFERROR(F169/D169,0)","v":0},null,{"$f":"IF(H36=\"linia nie podlega dopłacie-art. 11e\",0,'Weryfikacja 1'!S4)","v":0}]
[3,"",null,0,null,0,0,null,{"$f":"IF(H37=\"linia nie podlega dopłacie-art. 11e\",0,'Weryfikacja 1'!S5)","v":0}]
[4,"",null,0,null,0,0,null,{"$f":"IF(H38=\"linia nie podlega dopłacie-art. 11e\",0,'Weryfikacja 1'!S6)","v":0}]
[5,"",null,0,null,0,0,null,{"$f":"IF(H39=\"linia nie podlega dopłacie-art. 11e\",0,'Weryfikacja 1'!S7)","v":0}]
[6,"",null,0,null,0,0,null,{"$f":"IF(H40=\"linia nie podlega dopłacie-art. 11e\",0,'Weryfikacja 1'!S8)","v":0}]
[7,"",null,0,null,0,0,null,{"$f":"IF(H41=\"linia nie podlega dopłacie-art. 11e\",0,'Weryfikacja 1'!S9)","v":0}]
[8,"",null,0,null,0,0,null,{"$f":"IF(H42=\"linia nie podlega dopłacie-art. 11e\",0,'Weryfikacja 1'!S10)","v":0}]
[9,"",null,0,null,0,0,null,{"$f":"IF(H43=\"linia nie podlega dopłacie-art. 11e\",0,'Weryfikacja 1'!S11)","v":0}]
[10,"",null,0,null,0,0,null,{"$f":"IF(H44=\"linia nie podlega dopłacie-art. 11e\",0,'Weryfikacja 1'!S12)","v":0}]
[11,"",null,0,null,0,0,null,{"$f":"IF(H45=\"linia nie podlega dopłacie-art. 11e\",0,'Weryfikacja 1'!S13)","v":0}]
[12,"",null,0,null,0,0,null,{"$f":"IF(H46=\"linia nie podlega dopłacie-art. 11e\",0,'Weryfikacja 1'!S14)","v":0}]
[13,"",null,0,null,0,0,null,{"$f":"IF(H47=\"linia nie podlega dopłacie-art. 11e\",0,'Weryfikacja 1'!S15)","v":0}]
[14,"",null,0,null,0,0,null,{"$f":"IF(H48=\"linia nie podlega dopłacie-art. 11e\",0,'Weryfikacja 1'!S16)","v":0}]
[15,"",null,0,null,0,0,null,{"$f":"IF(H49=\"linia nie podlega dopłacie-art. 11e\",0,'Weryfikacja 1'!S17)","v":0}]
[16,"",null,0,null,0,0,null,{"$f":"IF(H50=\"linia nie podlega dopłacie-art. 11e\",0,'Weryfikacja 1'!S18)","v":0}]
[17,"",null,0,null,0,0,null,{"$f":"IF(H51=\"linia nie podlega dopłacie-art. 11e\",0,'Weryfikacja 1'!S19)","v":0}]
[18,"",null,0,null,0,0,null,{"$f":"IF(H52=\"linia nie podlega dopłacie-art. 11e\",0,'Weryfikacja 1'!S20)","v":0}]
[19,"",null,0,null,0,0,null,{"$f":"IF(H53=\"linia nie podlega dopłacie-art. 11e\",0,'Weryfikacja 1'!S21)","v":0}]
[20,"",null,0,null,0,0,null,{"$f":"IF(H54=\"linia nie podlega dopłacie-art. 11e\",0,'Weryfikacja 1'!S22)","v":0}]
[21,"",null,0,null,0,0,null,{"$f":"IF(H55=\"linia nie podlega dopłacie-art. 11e\",0,'Weryfikacja 1'!S23)","v":0}]
[22,"",null,0,null,0,0,null,{"$f":"IF(H56=\"linia nie podlega dopłacie-art. 11e\",0,'Weryfikacja 1'!S24)","v":0}]
[23,"",null,0,null,0,0,null,{"$f":"IF(H57=\"linia nie podlega dopłacie-art. 11e\",0,'Weryfikacja 1'!S25)","v":0}]
[24,"",null,0,null,0,0,null,{"$f":"IF(H58=\"linia nie podlega dopłacie-art. 11e\",0,'Weryfikacja 1'!S26)","v":0}]
[25,"",null,0,null,0,0,null,{"$f":"IF(H59=\"linia nie podlega dopłacie-art. 11e\",0,'Weryfikacja 1'!S27)","v":0}]
[26,"",null,0,null,0,0,null,{"$f":"IF(H60=\"linia nie podlega dopłacie-art. 11e\",0,'Weryfikacja 1'!S28)","v":0}]
[27,"",null,0,null,0,0,null,{"$f":"IF(H61=\"linia nie podlega dopłacie-art. 11e\",0,'Weryfikacja 1'!S29)","v":0}]
[28,"",null,0,null,0,0,null,{"$f":"IF(H62=\"linia nie podlega dopłacie-art. 11e\",0,'Weryfikacja 1'!S30)","v":0}]
[29,"",null,0,null,0,0,null,{"$f":"IF(H63=\"linia nie podlega dopłacie-art. 11e\",0,'Weryfikacja 1'!S31)","v":0}]
[30,"",null,0,null,0,0,null,{"$f":"IF(H64=\"linia nie podlega dopłacie-art. 11e\",0,'Weryfikacja 1'!S32)","v":0}]
[31,"",null,0,null,0,0,null,{"$f":"IF(H65=\"linia nie podlega dopłacie-art. 11e\",0,'Weryfikacja 1'!S33)","v":0}]
[32,"",null,0,null,0,0,null,{"$f":"IF(H66=\"linia nie podlega dopłacie-art. 11e\",0,'Weryfikacja 1'!S34)","v":0}]
[33,"",null,0,null,0,0,null,{"$f":"IF(H67=\"linia nie podlega dopłacie-art. 11e\",0,'Weryfikacja 1'!S35)","v":0}]
[34,"",null,0,null,0,0,null,{"$f":"IF(H68=\"linia nie podlega dopłacie-art. 11e\",0,'Weryfikacja 1'!S36)","v":0}]
[35,"",null,0,null,0,0,null,{"$f":"IF(H69=\"linia nie podlega dopłacie-art. 11e\",0,'Weryfikacja 1'!S37)","v":0}]
[36,"",null,0,null,0,0,null,{"$f":"IF(H70=\"linia nie podlega dopłacie-art. 11e\",0,'Weryfikacja 1'!S38)","v":0}]
[37,"",null,0,null,0,0,null,{"$f":"IF(H71=\"linia nie podlega dopłacie-art. 11e\",0,'Weryfikacja 1'!S39)","v":0}]
[38,"",null,0,null,0,0,null,{"$f":"IF(H72=\"linia nie podlega dopłacie-art. 11e\",0,'Weryfikacja 1'!S40)","v":0}]
[39,"",null,0,null,0,0,null,{"$f":"IF(H73=\"linia nie podlega dopłacie-art. 11e\",0,'Weryfikacja 1'!S41)","v":0}]
[40,"",null,0,null,0,0,null,{"$f":"IF(H74=\"linia nie podlega dopłacie-art. 11e\",0,'Weryfikacja 1'!S42)","v":0}]
[41,"",null,0,null,0,0,null,{"$f":"IF(H75=\"linia nie podlega dopłacie-art. 11e\",0,'Weryfikacja 1'!S43)","v":0}]
[42,"",null,0,null,0,0,null,{"$f":"IF(H76=\"linia nie podlega dopłacie-art. 11e\",0,'Weryfikacja 1'!S44)","v":0}]
[43,"",null,0,null,0,0,null,{"$f":"IF(H77=\"linia nie podlega dopłacie-art. 11e\",0,'Weryfikacja 1'!S45)","v":0}]
[44,"",null,0,null,0,0,null,{"$f":"IF(H78=\"linia nie podlega dopłacie-art. 11e\",0,'Weryfikacja 1'!S46)","v":0}]
[45,"",null,0,null,0,0,null,{"$f":"IF(H79=\"linia nie podlega dopłacie-art. 11e\",0,'Weryfikacja 1'!S47)","v":0}]
[46,"",null,0,null,0,0,null,{"$f":"IF(H80=\"linia nie podlega dopłacie-art. 11e\",0,'Weryfikacja 1'!S48)","v":0}]
[47,"",null,0,null,0,0,null,{"$f":"IF(H81=\"linia nie podlega dopłacie-art. 11e\",0,'Weryfikacja 1'!S49)","v":0}]
[48,"",null,0,null,0,0,null,{"$f":"IF(H82=\"linia nie podlega dopłacie-art. 11e\",0,'Weryfikacja 1'!S50)","v":0}]
[49,"",null,0,null,0,0,null,{"$f":"IF(H83=\"linia nie podlega dopłacie-art. 11e\",0,'Weryfikacja 1'!S51)","v":0}]
[50,"",null,0,null,0,0,null,{"$f":"IF(H84=\"linia nie podlega dopłacie-art. 11e\",0,'Weryfikacja 1'!S52)","v":0}]
[51,"",null,0,null,0,0,null,{"$f":"IF(H85=\"linia nie podlega dopłacie-art. 11e\",0,'Weryfikacja 1'!S53)","v":0}]
[52,"",null,0,null,0,0,null,{"$f":"IF(H86=\"linia nie podlega dopłacie-art. 11e\",0,'Weryfikacja 1'!S54)","v":0}]
[53,"",null,0,null,0,0,null,{"$f":"IF(H87=\"linia nie podlega dopłacie-art. 11e\",0,'Weryfikacja 1'!S55)","v":0}]
[54,"",null,0,null,0,0,null,{"$f":"IF(H88=\"linia nie podlega dopłacie-art. 11e\",0,'Weryfikacja 1'!S56)","v":0}]
[55,"",null,0,null,0,0,null,{"$f":"IF(H89=\"linia nie podlega dopłacie-art. 11e\",0,'Weryfikacja 1'!S57)","v":0}]
[56,"",null,0,null,0,0,null,{"$f":"IF(H90=\"linia nie podlega dopłacie-art. 11e\",0,'Weryfikacja 1'!S58)","v":0}]
[57,"",null,0,null,0,0,null,{"$f":"IF(H91=\"linia nie podlega dopłacie-art. 11e\",0,'Weryfikacja 1'!S59)","v":0}]
[58,"",null,0,null,0,0,null,{"$f":"IF(H92=\"linia nie podlega dopłacie-art. 11e\",0,'Weryfikacja 1'!S60)","v":0}]
[59,"",null,0,null,0,0,null,{"$f":"IF(H93=\"linia nie podlega dopłacie-art. 11e\",0,'Weryfikacja 1'!S61)","v":0}]
[60,"",null,0,null,0,0,null,{"$f":"IF(H94=\"linia nie podlega dopłacie-art. 11e\",0,'Weryfikacja 1'!S62)","v":0}]
[61,"",null,0,null,0,0,null,{"$f":"IF(H95=\"linia nie podlega dopłacie-art. 11e\",0,'Weryfikacja 1'!S63)","v":0}]
[62,"",null,0,null,0,0,null,{"$f":"IF(H96=\"linia nie podlega dopłacie-art. 11e\",0,'Weryfikacja 1'!S64)","v":0}]
[63,"",null,0,null,0,0,null,{"$f":"IF(H97=\"linia nie podlega dopłacie-art. 11e\",0,'Weryfikacja 1'!S65)","v":0}]
[64,"",null,0,null,0,0,null,{"$f":"IF(H98=\"linia nie podlega dopłacie-art. 11e\",0,'Weryfikacja 1'!S66)","v":0}]
[65,"",null,0,null,0,0,null,{"$f":"IF(H99=\"linia nie podlega dopłacie-art. 11e\",0,'Weryfikacja 1'!S67)","v":0}]
[{"$f":"A100","v":66},{"$f":"IF(B100=\"\",\"\",B100)","v":""},null,{"$f":"IFERROR(E233/C233,0)","v":0},null,{"$f":"IFERROR(H233/C233,0)","v":0},{"$f":"IFERROR(F233/D233,0)","v":0},null,{"$f":"IF(H100=\"linia nie podlega dopłacie-art. 11e\",0,'Weryfikacja 1'!S68)","v":0}]
[67,"",null,0,null,0,0,null,{"$f":"IF(H101=\"linia nie podlega dopłacie-art. 11e\",0,'Weryfikacja 1'!S69)","v":0}]
[68,"",null,0,null,0,0,null,{"$f":"IF(H102=\"linia nie podlega dopłacie-art. 11e\",0,'Weryfikacja 1'!S70)","v":0}]
[69,"",null,0,null,0,0,null,{"$f":"IF(H103=\"linia nie podlega dopłacie-art. 11e\",0,'Weryfikacja 1'!S71)","v":0}]
[70,"",null,0,null,0,0,null,{"$f":"IF(H104=\"linia nie podlega dopłacie-art. 11e\",0,'Weryfikacja 1'!S72)","v":0}]
[71,"",null,0,null,0,0,null,{"$f":"IF(H105=\"linia nie podlega dopłacie-art. 11e\",0,'Weryfikacja 1'!S73)","v":0}]
[72,"",null,0,null,0,0,null,{"$f":"IF(H106=\"linia nie podlega dopłacie-art. 11e\",0,'Weryfikacja 1'!S74)","v":0}]
[73,"",null,0,null,0,0,null,{"$f":"IF(H107=\"linia nie podlega dopłacie-art. 11e\",0,'Weryfikacja 1'!S75)","v":0}]
[74,"",null,0,null,0,0,null,{"$f":"IF(H108=\"linia nie podlega dopłacie-art. 11e\",0,'Weryfikacja 1'!S76)","v":0}]
[75,"",null,0,null,0,0,null,{"$f":"IF(H109=\"linia nie podlega dopłacie-art. 11e\",0,'Weryfikacja 1'!S77)","v":0}]
[76,"",null,0,null,0,0,null,{"$f":"IF(H110=\"linia nie podlega dopłacie-art. 11e\",0,'Weryfikacja 1'!S78)","v":0}]
[77,"",null,0,null,0,0,null,{"$f":"IF(H111=\"linia nie podlega dopłacie-art. 11e\",0,'Weryfikacja 1'!S79)","v":0}]
[78,"",null,0,null,0,0,null,{"$f":"IF(H112=\"linia nie podlega dopłacie-art. 11e\",0,'Weryfikacja 1'!S80)","v":0}]
[79,"",null,0,null,0,0,null,{"$f":"IF(H113=\"linia nie podlega dopłacie-art. 11e\",0,'Weryfikacja 1'!S81)","v":0}]
[80,"",null,0,null,0,0,null,{"$f":"IF(H114=\"linia nie podlega dopłacie-art. 11e\",0,'Weryfikacja 1'!S82)","v":0}]
[81,"",null,0,null,0,0,null,{"$f":"IF(H115=\"linia nie podlega dopłacie-art. 11e\",0,'Weryfikacja 1'!S83)","v":0}]
[82,"",null,0,null,0,0,null,{"$f":"IF(H116=\"linia nie podlega dopłacie-art. 11e\",0,'Weryfikacja 1'!S84)","v":0}]
[83,"",null,0,null,0,0,null,{"$f":"IF(H117=\"linia nie podlega dopłacie-art. 11e\",0,'Weryfikacja 1'!S85)","v":0}]
[84,"",null,0,null,0,0,null,{"$f":"IF(H118=\"linia nie podlega dopłacie-art. 11e\",0,'Weryfikacja 1'!S86)","v":0}]
[85,"",null,0,null,0,0,null,{"$f":"IF(H119=\"linia nie podlega dopłacie-art. 11e\",0,'Weryfikacja 1'!S87)","v":0}]
[86,"",null,0,null,0,0,null,{"$f":"IF(H120=\"linia nie podlega dopłacie-art. 11e\",0,'Weryfikacja 1'!S88)","v":0}]
[87,"",null,0,null,0,0,null,{"$f":"IF(H121=\"linia nie podlega dopłacie-art. 11e\",0,'Weryfikacja 1'!S89)","v":0}]
[88,"",null,0,null,0,0,null,{"$f":"IF(H122=\"linia nie podlega dopłacie-art. 11e\",0,'Weryfikacja 1'!S90)","v":0}]
[89,"",null,0,null,0,0,null,{"$f":"IF(H123=\"linia nie podlega dopłacie-art. 11e\",0,'Weryfikacja 1'!S91)","v":0}]
[90,"",null,0,null,0,0,null,{"$f":"IF(H124=\"linia nie podlega dopłacie-art. 11e\",0,'Weryfikacja 1'!S92)","v":0}]
[91,"",null,0,null,0,0,null,{"$f":"IF(H125=\"linia nie podlega dopłacie-art. 11e\",0,'Weryfikacja 1'!S93)","v":0}]
[92,"",null,0,null,0,0,null,{"$f":"IF(H126=\"linia nie podlega dopłacie-art. 11e\",0,'Weryfikacja 1'!S94)","v":0}]
[93,"",null,0,null,0,0,null,{"$f":"IF(H127=\"linia nie podlega dopłacie-art. 11e\",0,'Weryfikacja 1'!S95)","v":0}]
[94,"",null,0,null,0,0,null,{"$f":"IF(H128=\"linia nie podlega dopłacie-art. 11e\",0,'Weryfikacja 1'!S96)","v":0}]
[95,"",null,0,null,0,0,null,{"$f":"IF(H129=\"linia nie podlega dopłacie-art. 11e\",0,'Weryfikacja 1'!S97)","v":0}]
[96,"",null,0,null,0,0,null,{"$f":"IF(H130=\"linia nie podlega dopłacie-art. 11e\",0,'Weryfikacja 1'!S98)","v":0}]
[97,"",null,0,null,0,0,null,{"$f":"IF(H131=\"linia nie podlega dopłacie-art. 11e\",0,'Weryfikacja 1'!S99)","v":0}]
[98,"",null,0,null,0,0,null,{"$f":"IF(H132=\"linia nie podlega dopłacie-art. 11e\",0,'Weryfikacja 1'!S100)","v":0}]
[99,"",null,0,null,0,0,null,{"$f":"IF(H133=\"linia nie podlega dopłacie-art. 11e\",0,'Weryfikacja 1'!S101)","v":0}]
[100,"",null,0,null,0,0,null,{"$f":"IF(H134=\"linia nie podlega dopłacie-art. 11e\",0,'Weryfikacja 1'!S102)","v":0}]
[101,"",null,0,null,0,0,null,{"$f":"IF(H135=\"linia nie podlega dopłacie-art. 11e\",0,'Weryfikacja 1'!S103)","v":0}]
[102,"",null,0,null,0,0,null,{"$f":"IF(H136=\"linia nie podlega dopłacie-art. 11e\",0,'Weryfikacja 1'!S104)","v":0}]
[103,"",null,0,null,0,0,null,{"$f":"IF(H137=\"linia nie podlega dopłacie-art. 11e\",0,'Weryfikacja 1'!S105)","v":0}]
[104,"",null,0,null,0,0,null,{"$f":"IF(H138=\"linia nie podlega dopłacie-art. 11e\",0,'Weryfikacja 1'!S106)","v":0}]
[105,"",null,0,null,0,0,null,{"$f":"IF(H139=\"linia nie podlega dopłacie-art. 11e\",0,'Weryfikacja 1'!S107)","v":0}]
[106,"",null,0,null,0,0,null,{"$f":"IF(H140=\"linia nie podlega dopłacie-art. 11e\",0,'Weryfikacja 1'!S108)","v":0}]
[107,"",null,0,null,0,0,null,{"$f":"IF(H141=\"linia nie podlega dopłacie-art. 11e\",0,'Weryfikacja 1'!S109)","v":0}]
[108,"",null,0,null,0,0,null,{"$f":"IF(H142=\"linia nie podlega dopłacie-art. 11e\",0,'Weryfikacja 1'!S110)","v":0}]
[109,"",null,0,null,0,0,null,{"$f":"IF(H143=\"linia nie podlega dopłacie-art. 11e\",0,'Weryfikacja 1'!S111)","v":0}]
[110,"",null,0,null,0,0,null,{"$f":"IF(H144=\"linia nie podlega dopłacie-art. 11e\",0,'Weryfikacja 1'!S112)","v":0}]
[111,"",null,0,null,0,0,null,{"$f":"IF(H145=\"linia nie podlega dopłacie-art. 11e\",0,'Weryfikacja 1'!S113)","v":0}]
[112,"",null,0,null,0,0,null,{"$f":"IF(H146=\"linia nie podlega dopłacie-art. 11e\",0,'Weryfikacja 1'!S114)","v":0}]
[113,"",null,0,null,0,0,null,{"$f":"IF(H147=\"linia nie podlega dopłacie-art. 11e\",0,'Weryfikacja 1'!S115)","v":0}]
[114,"",null,0,null,0,0,null,{"$f":"IF(H148=\"linia nie podlega dopłacie-art. 11e\",0,'Weryfikacja 1'!S116)","v":0}]
[115,"",null,0,null,0,0,null,{"$f":"IF(H149=\"linia nie podlega dopłacie-art. 11e\",0,'Weryfikacja 1'!S117)","v":0}]
["Ogółem:",null,{"$f":"SUM(C168:C282)","v":0},null,{"$f":"SUM(E168:E282)","v":0},null,null,{"$f":"SUM(H168:H282)","v":0},{"$f":"SUMIF(I168:I282,\">0\")","v":0}]
[]
["B.3  Dane dotyczące linii komunikacyjnych "]
["MIESIĄC",null,null,{"$f":"IF(E19=\"I KWARTAŁ\",\"LUTY\",IF(E19=\"II KWARTAŁ\",\"MAJ\",IF(E19=\"III KWARTAŁ\",\"SIERPIEŃ\",IF(E19=\"IV KWARTAŁ\",\"LISTOPAD\",\"\"))))","v":"LUTY"},null,"2026 r."]
["Lp.","Nazwa linii komunikacyjnej","Przewidywana wielkość pracy eksploatacyjnej w okresie rozliczeniowym \n[wzkm]","Cena usługi [zł]","Planowany deficyt w okresie rozliczeniowym [zł]","Część ceny usługi sfinansowana ze środków własnych organizatora \n[zł/wzkm]","Procentowa wartość części ceny usługi sfinansowanej ze środków własnych organizatora [%]","Kwota środków własnych organizatora [zł]","Kwota dopłaty \nw okresie rozliczeniowym \n[zł]"]
[null,1,2,3,4,5,6,7,8]
[{"$f":"A35","v":1},{"$f":"IF(B35=\"\",\"\",B35)","v":""},null,{"$f":"IFERROR(E289/C289,0)","v":0},null,{"$f":"IFERROR(H289/C289,0)","v":0},{"$f":"IFERROR(F289/D289,0)","v":0},null,{"$f":"IF(H35=\"linia nie podlega dopłacie-art. 11e\",0,'Weryfikacja 2'!S3)","v":0}]
[{"$f":"A36","v":2},{"$f":"IF(B36=\"\",\"\",B36)","v":""},null,{"$f":"IFERROR(E290/C290,0)","v":0},null,{"$f":"IFERROR(H290/C290,0)","v":0},{"$f":"IFERROR(F290/D290,0)","v":0},null,{"$f":"IF(H36=\"linia nie podlega dopłacie-art. 11e\",0,'Weryfikacja 2'!S4)","v":0}]
[3,"",null,0,null,0,0,null,{"$f":"IF(H37=\"linia nie podlega dopłacie-art. 11e\",0,'Weryfikacja 2'!S5)","v":0}]
[4,"",null,0,null,0,0,null,{"$f":"IF(H38=\"linia nie podlega dopłacie-art. 11e\",0,'Weryfikacja 2'!S6)","v":0}]
[5,"",null,0,null,0,0,null,{"$f":"IF(H39=\"linia nie podlega dopłacie-art. 11e\",0,'Weryfikacja 2'!S7)","v":0}]
[6,"",null,0,null,0,0,null,{"$f":"IF(H40=\"linia nie podlega dopłacie-art. 11e\",0,'Weryfikacja 2'!S8)","v":0}]
[7,"",null,0,null,0,0,null,{"$f":"IF(H41=\"linia nie podlega dopłacie-art. 11e\",0,'Weryfikacja 2'!S9)","v":0}]
[8,"",null,0,null,0,0,null,{"$f":"IF(H42=\"linia nie podlega dopłacie-art. 11e\",0,'Weryfikacja 2'!S10)","v":0}]
[9,"",null,0,null,0,0,null,{"$f":"IF(H43=\"linia nie podlega dopłacie-art. 11e\",0,'Weryfikacja 2'!S11)","v":0}]
[10,"",null,0,null,0,0,null,{"$f":"IF(H44=\"linia nie podlega dopłacie-art. 11e\",0,'Weryfikacja 2'!S12)","v":0}]
[11,"",null,0,null,0,0,null,{"$f":"IF(H45=\"linia nie podlega dopłacie-art. 11e\",0,'Weryfikacja 2'!S13)","v":0}]
[12,"",null,0,null,0,0,null,{"$f":"IF(H46=\"linia nie podlega dopłacie-art. 11e\",0,'Weryfikacja 2'!S14)","v":0}]
[13,"",null,0,null,0,0,null,{"$f":"IF(H47=\"linia nie podlega dopłacie-art. 11e\",0,'Weryfikacja 2'!S15)","v":0}]
[14,"",null,0,null,0,0,null,{"$f":"IF(H48=\"linia nie podlega dopłacie-art. 11e\",0,'Weryfikacja 2'!S16)","v":0}]
[15,"",null,0,null,0,0,null,{"$f":"IF(H49=\"linia nie podlega dopłacie-art. 11e\",0,'Weryfikacja 2'!S17)","v":0}]
[16,"",null,0,null,0,0,null,{"$f":"IF(H50=\"linia nie podlega dopłacie-art. 11e\",0,'Weryfikacja 2'!S18)","v":0}]
[17,"",null,0,null,0,0,null,{"$f":"IF(H51=\"linia nie podlega dopłacie-art. 11e\",0,'Weryfikacja 2'!S19)","v":0}]
[18,"",null,0,null,0,0,null,{"$f":"IF(H52=\"linia nie podlega dopłacie-art. 11e\",0,'Weryfikacja 2'!S20)","v":0}]
[19,"",null,0,null,0,0,null,{"$f":"IF(H53=\"linia nie podlega dopłacie-art. 11e\",0,'Weryfikacja 2'!S21)","v":0}]
[20,"",null,0,null,0,0,null,{"$f":"IF(H54=\"linia nie podlega dopłacie-art. 11e\",0,'Weryfikacja 2'!S22)","v":0}]
[21,"",null,0,null,0,0,null,{"$f":"IF(H55=\"linia nie podlega dopłacie-art. 11e\",0,'Weryfikacja 2'!S23)","v":0}]
[22,"",null,0,null,0,0,null,{"$f":"IF(H56=\"linia nie podlega dopłacie-art. 11e\",0,'Weryfikacja 2'!S24)","v":0}]
[23,"",null,0,null,0,0,null,{"$f":"IF(H57=\"linia nie podlega dopłacie-art. 11e\",0,'Weryfikacja 2'!S25)","v":0}]
[24,"",null,0,null,0,0,null,{"$f":"IF(H58=\"linia nie podlega dopłacie-art. 11e\",0,'Weryfikacja 2'!S26)","v":0}]
[25,"",null,0,null,0,0,null,{"$f":"IF(H59=\"linia nie podlega dopłacie-art. 11e\",0,'Weryfikacja 2'!S27)","v":0}]
[26,"",null,0,null,0,0,null,{"$f":"IF(H60=\"linia nie podlega dopłacie-art. 11e\",0,'Weryfikacja 2'!S28)","v":0}]
[27,"",null,0,null,0,0,null,{"$f":"IF(H61=\"linia nie podlega dopłacie-art. 11e\",0,'Weryfikacja 2'!S29)","v":0}]
[28,"",null,0,null,0,0,null,{"$f":"IF(H62=\"linia nie podlega dopłacie-art. 11e\",0,'Weryfikacja 2'!S30)","v":0}]
[29,"",null,0,null,0,0,null,{"$f":"IF(H63=\"linia nie podlega dopłacie-art. 11e\",0,'Weryfikacja 2'!S31)","v":0}]
[30,"",null,0,null,0,0,null,{"$f":"IF(H64=\"linia nie podlega dopłacie-art. 11e\",0,'Weryfikacja 2'!S32)","v":0}]
[31,"",null,0,null,0,0,null,{"$f":"IF(H65=\"linia nie podlega dopłacie-art. 11e\",0,'Weryfikacja 2'!S33)","v":0}]
[32,"",null,0,null,0,0,null,{"$f":"IF(H66=\"linia nie podlega dopłacie-art. 11e\",0,'Weryfikacja 2'!S34)","v":0}]
[33,"",null,0,null,0,0,null,{"$f":"IF(H67=\"linia nie podlega dopłacie-art. 11e\",0,'Weryfikacja 2'!S35)","v":0}]
[34,"",null,0,null,0,0,null,{"$f":"IF(H68=\"linia nie podlega dopłacie-art. 11e\",0,'Weryfikacja 2'!S36)","v":0}]
[35,"",null,0,null,0,0,null,{"$f":"IF(H69=\"linia nie podlega dopłacie-art. 11e\",0,'Weryfikacja 2'!S37)","v":0}]
[36,"",null,0,null,0,0,null,{"$f":"IF(H70=\"linia nie podlega dopłacie-art. 11e\",0,'Weryfikacja 2'!S38)","v":0}]
[37,"",null,0,null,0,0,null,{"$f":"IF(H71=\"linia nie podlega dopłacie-art. 11e\",0,'Weryfikacja 2'!S39)","v":0}]
[38,"",null,0,null,0,0,null,{"$f":"IF(H72=\"linia nie podlega dopłacie-art. 11e\",0,'Weryfikacja 2'!S40)","v":0}]
[39,"",null,0,null,0,0,null,{"$f":"IF(H73=\"linia nie podlega dopłacie-art. 11e\",0,'Weryfikacja 2'!S41)","v":0}]
[40,"",null,0,null,0,0,null,{"$f":"IF(H74=\"linia nie podlega dopłacie-art. 11e\",0,'Weryfikacja 2'!S42)","v":0}]
[41,"",null,0,null,0,0,null,{"$f":"IF(H75=\"linia nie podlega dopłacie-art. 11e\",0,'Weryfikacja 2'!S43)","v":0}]
[42,"",null,0,null,0,0,null,{"$f":"IF(H76=\"linia nie podlega dopłacie-art. 11e\",0,'Weryfikacja 2'!S44)","v":0}]
[43,"",null,0,null,0,0,null,{"$f":"IF(H77=\"linia nie podlega dopłacie-art. 11e\",0,'Weryfikacja 2'!S45)","v":0}]
[44,"",null,0,null,0,0,null,{"$f":"IF(H78=\"linia nie podlega dopłacie-art. 11e\",0,'Weryfikacja 2'!S46)","v":0}]
[45,"",null,0,null,0,0,null,{"$f":"IF(H79=\"linia nie podlega dopłacie-art. 11e\",0,'Weryfikacja 2'!S47)","v":0}]
[46,"",null,0,null,0,0,null,{"$f":"IF(H80=\"linia nie podlega dopłacie-art. 11e\",0,'Weryfikacja 2'!S48)","v":0}]
[47,"",null,0,null,0,0,null,{"$f":"IF(H81=\"linia nie podlega dopłacie-art. 11e\",0,'Weryfikacja 2'!S49)","v":0}]
[48,"",null,0,null,0,0,null,{"$f":"IF(H82=\"linia nie podlega dopłacie-art. 11e\",0,'Weryfikacja 2'!S50)","v":0}]
[49,"",null,0,null,0,0,null,{"$f":"IF(H83=\"linia nie podlega dopłacie-art. 11e\",0,'Weryfikacja 2'!S51)","v":0}]
[50,"",null,0,null,0,0,null,{"$f":"IF(H84=\"linia nie podlega dopłacie-art. 11e\",0,'Weryfikacja 2'!S52)","v":0}]
[51,"",null,0,null,0,0,null,{"$f":"IF(H85=\"linia nie podlega dopłacie-art. 11e\",0,'Weryfikacja 2'!S53)","v":0}]
[52,"",null,0,null,0,0,null,{"$f":"IF(H86=\"linia nie podlega dopłacie-art. 11e\",0,'Weryfikacja 2'!S54)","v":0}]
[53,"",null,0,null,0,0,null,{"$f":"IF(H87=\"linia nie podlega dopłacie-art. 11e\",0,'Weryfikacja 2'!S55)","v":0}]
[54,"",null,0,null,0,0,null,{"$f":"IF(H88=\"linia nie podlega dopłacie-art. 11e\",0,'Weryfikacja 2'!S56)","v":0}]
[55,"",null,0,null,0,0,null,{"$f":"IF(H89=\"linia nie podlega dopłacie-art. 11e\",0,'Weryfikacja 2'!S57)","v":0}]
[56,"",null,0,null,0,0,null,{"$f":"IF(H90=\"linia nie podlega dopłacie-art. 11e\",0,'Weryfikacja 2'!S58)","v":0}]
[57,"",null,0,null,0,0,null,{"$f":"IF(H91=\"linia nie podlega dopłacie-art. 11e\",0,'Weryfikacja 2'!S59)","v":0}]
[58,"",null,0,null,0,0,null,{"$f":"IF(H92=\"linia nie podlega dopłacie-art. 11e\",0,'Weryfikacja 2'!S60)","v":0}]
[59,"",null,0,null,0,0,null,{"$f":"IF(H93=\"linia nie podlega dopłacie-art. 11e\",0,'Weryfikacja 2'!S61)","v":0}]
[60,"",null,0,null,0,0,null,{"$f":"IF(H94=\"linia nie podlega dopłacie-art. 11e\",0,'Weryfikacja 2'!S62)","v":0}]
[61,"",null,0,null,0,0,null,{"$f":"IF(H95=\"linia nie podlega dopłacie-art. 11e\",0,'Weryfikacja 2'!S63)","v":0}]
[62,"",null,0,null,0,0,null,{"$f":"IF(H96=\"linia nie podlega dopłacie-art. 11e\",0,'Weryfikacja 2'!S64)","v":0}]
[63,"",null,0,null,0,0,null,{"$f":"IF(H97=\"linia nie podlega dopłacie-art. 11e\",0,'Weryfikacja 2'!S65)","v":0}]
[64,"",null,0,null,0,0,null,{"$f":"IF(H98=\"linia nie podlega dopłacie-art. 11e\",0,'Weryfikacja 2'!S66)","v":0}]
[65,"",null,0,null,0,0,null,{"$f":"IF(H99=\"linia nie podlega dopłacie-art. 11e\",0,'Weryfikacja 2'!S67)","v":0}]
[{"$f":"A100","v":66},{"$f":"IF(B100=\"\",\"\",B100)","v":""},null,{"$f":"IFERROR(E354/C354,0)","v":0},null,{"$f":"IFERROR(H354/C354,0)","v":0},{"$f":"IFERROR(F354/D354,0)","v":0},null,{"$f":"IF(H100=\"linia nie podlega dopłacie-art. 11e\",0,'Weryfikacja 2'!S68)","v":0}]
[67,"",null,0,null,0,0,null,{"$f":"IF(H101=\"linia nie podlega dopłacie-art. 11e\",0,'Weryfikacja 2'!S69)","v":0}]
[68,"",null,0,null,0,0,null,{"$f":"IF(H102=\"linia nie podlega dopłacie-art. 11e\",0,'Weryfikacja 2'!S70)","v":0}]
[69,"",null,0,null,0,0,null,{"$f":"IF(H103=\"linia nie podlega dopłacie-art. 11e\",0,'Weryfikacja 2'!S71)","v":0}]
[70,"",null,0,null,0,0,null,{"$f":"IF(H104=\"linia nie podlega dopłacie-art. 11e\",0,'Weryfikacja 2'!S72)","v":0}]
[71,"",null,0,null,0,0,null,{"$f":"IF(H105=\"linia nie podlega dopłacie-art. 11e\",0,'Weryfikacja 2'!S73)","v":0}]
[72,"",null,0,null,0,0,null,{"$f":"IF(H106=\"linia nie podlega dopłacie-art. 11e\",0,'Weryfikacja 2'!S74)","v":0}]
[73,"",null,0,null,0,0,null,{"$f":"IF(H107=\"linia nie podlega dopłacie-art. 11e\",0,'Weryfikacja 2'!S75)","v":0}]
[74,"",null,0,null,0,0,null,{"$f":"IF(H108=\"linia nie podlega dopłacie-art. 11e\",0,'Weryfikacja 2'!S76)","v":0}]
[75,"",null,0,null,0,0,null,{"$f":"IF(H109=\"linia nie podlega dopłacie-art. 11e\",0,'Weryfikacja 2'!S77)","v":0}]
[76,"",null,0,null,0,0,null,{"$f":"IF(H110=\"linia nie podlega dopłacie-art. 11e\",0,'Weryfikacja 2'!S78)","v":0}]
[77,"",null,0,null,0,0,null,{"$f":"IF(H111=\"linia nie podlega dopłacie-art. 11e\",0,'Weryfikacja 2'!S79)","v":0}]
[78,"",null,0,null,0,0,null,{"$f":"IF(H112=\"linia nie podlega dopłacie-art. 11e\",0,'Weryfikacja 2'!S80)","v":0}]
[79,"",null,0,null,0,0,null,{"$f":"IF(H113=\"linia nie podlega dopłacie-art. 11e\",0,'Weryfikacja 2'!S81)","v":0}]
[80,"",null,0,null,0,0,null,{"$f":"IF(H114=\"linia nie podlega dopłacie-art. 11e\",0,'Weryfikacja 2'!S82)","v":0}]
[81,"",null,0,null,0,0,null,{"$f":"IF(H115=\"linia nie podlega dopłacie-art. 11e\",0,'Weryfikacja 2'!S83)","v":0}]
[82,"",null,0,null,0,0,null,{"$f":"IF(H116=\"linia nie podlega dopłacie-art. 11e\",0,'Weryfikacja 2'!S84)","v":0}]
[83,"",null,0,null,0,0,null,{"$f":"IF(H117=\"linia nie podlega dopłacie-art. 11e\",0,'Weryfikacja 2'!S85)","v":0}]
[84,"",null,0,null,0,0,null,{"$f":"IF(H118=\"linia nie podlega dopłacie-art. 11e\",0,'Weryfikacja 2'!S86)","v":0}]
[85,"",null,0,null,0,0,null,{"$f":"IF(H119=\"linia nie podlega dopłacie-art. 11e\",0,'Weryfikacja 2'!S87)","v":0}]
[86,"",null,0,null,0,0,null,{"$f":"IF(H120=\"linia nie podlega dopłacie-art. 11e\",0,'Weryfikacja 2'!S88)","v":0}]
[87,"",null,0,null,0,0,null,{"$f":"IF(H121=\"linia nie podlega dopłacie-art. 11e\",0,'Weryfikacja 2'!S89)","v":0}]
[88,"",null,0,null,0,0,null,{"$f":"IF(H122=\"linia nie podlega dopłacie-art. 11e\",0,'Weryfikacja 2'!S90)","v":0}]
[89,"",null,0,null,0,0,null,{"$f":"IF(H123=\"linia nie podlega dopłacie-art. 11e\",0,'Weryfikacja 2'!S91)","v":0}]
[90,"",null,0,null,0,0,null,{"$f":"IF(H124=\"linia nie podlega dopłacie-art. 11e\",0,'Weryfikacja 2'!S92)","v":0}]
[91,"",null,0,null,0,0,null,{"$f":"IF(H125=\"linia nie podlega dopłacie-art. 11e\",0,'Weryfikacja 2'!S93)","v":0}]
[92,"",null,0,null,0,0,null,{"$f":"IF(H126=\"linia nie podlega dopłacie-art. 11e\",0,'Weryfikacja 2'!S94)","v":0}]
[93,"",null,0,null,0,0,null,{"$f":"IF(H127=\"linia nie podlega dopłacie-art. 11e\",0,'Weryfikacja 2'!S95)","v":0}]
[94,"",null,0,null,0,0,null,{"$f":"IF(H128=\"linia nie podlega dopłacie-art. 11e\",0,'Weryfikacja 2'!S96)","v":0}]
[95,"",null,0,null,0,0,null,{"$f":"IF(H129=\"linia nie podlega dopłacie-art. 11e\",0,'Weryfikacja 2'!S97)","v":0}]
[96,"",null,0,null,0,0,null,{"$f":"IF(H130=\"linia nie podlega dopłacie-art. 11e\",0,'Weryfikacja 2'!S98)","v":0}]
[97,"",null,0,null,0,0,null,{"$f":"IF(H131=\"linia nie podlega dopłacie-art. 11e\",0,'Weryfikacja 2'!S99)","v":0}]
[98,"",null,0,null,0,0,null,{"$f":"IF(H132=\"linia nie podlega dopłacie-art. 11e\",0,'Weryfikacja 2'!S100)","v":0}]
[99,"",null,0,null,0,0,null,{"$f":"IF(H133=\"linia nie podlega dopłacie-art. 11e\",0,'Weryfikacja 2'!S101)","v":0}]
[100,"",null,0,null,0,0,null,{"$f":"IF(H134=\"linia nie podlega dopłacie-art. 11e\",0,'Weryfikacja 2'!S102)","v":0}]
[101,"",null,0,null,0,0,null,{"$f":"IF(H135=\"linia nie podlega dopłacie-art. 11e\",0,'Weryfikacja 2'!S103)","v":0}]
[102,"",null,0,null,0,0,null,{"$f":"IF(H136=\"linia nie podlega dopłacie-art. 11e\",0,'Weryfikacja 2'!S104)","v":0}]
[103,"",null,0,null,0,0,null,{"$f":"IF(H137=\"linia nie podlega dopłacie-art. 11e\",0,'Weryfikacja 2'!S105)","v":0}]
[104,"",null,0,null,0,0,null,{"$f":"IF(H138=\"linia nie podlega dopłacie-art. 11e\",0,'Weryfikacja 2'!S106)","v":0}]
[105,"",null,0,null,0,0,null,{"$f":"IF(H139=\"linia nie podlega dopłacie-art. 11e\",0,'Weryfikacja 2'!S107)","v":0}]
[{"$f":"A140","v":106},"",null,0,null,0,0,null,{"$f":"IF(H140=\"linia nie podlega dopłacie-art. 11e\",0,'Weryfikacja 2'!S108)","v":0}]
[{"$f":"A141","v":107},"",null,0,null,0,0,null,{"$f":"IF(H141=\"linia nie podlega dopłacie-art. 11e\",0,'Weryfikacja 2'!S109)","v":0}]
[108,"",null,0,null,0,0,null,{"$f":"IF(H142=\"linia nie podlega dopłacie-art. 11e\",0,'Weryfikacja 2'!S110)","v":0}]
[109,"",null,0,null,0,0,null,{"$f":"IF(H143=\"linia nie podlega dopłacie-art. 11e\",0,'Weryfikacja 2'!S111)","v":0}]
[110,"",null,0,null,0,0,null,{"$f":"IF(H144=\"linia nie podlega dopłacie-art. 11e\",0,'Weryfikacja 2'!S112)","v":0}]
[111,"",null,0,null,0,0,null,{"$f":"IF(H145=\"linia nie podlega dopłacie-art. 11e\",0,'Weryfikacja 2'!S113)","v":0}]
[112,"",null,0,null,0,0,null,{"$f":"IF(H146=\"linia nie podlega dopłacie-art. 11e\",0,'Weryfikacja 2'!S114)","v":0}]
[113,"",null,0,null,0,0,null,{"$f":"IF(H147=\"linia nie podlega dopłacie-art. 11e\",0,'Weryfikacja 2'!S115)","v":0}]
[114,"",null,0,null,0,0,null,{"$f":"IF(H148=\"linia nie podlega dopłacie-art. 11e\",0,'Weryfikacja 2'!S116)","v":0}]
[115,"",null,0,null,0,0,null,{"$f":"IF(H149=\"linia nie podlega dopłacie-art. 11e\",0,'Weryfikacja 2'!S117)","v":0}]
["Ogółem:",null,{"$f":"SUM(C289:C403)","v":0},null,{"$f":"SUM(E289:E403)","v":0},null,null,{"$f":"SUM(H289:H403)","v":0},{"$f":"SUMIF(I289:I403,\">0\")","v":0}]
[]
["B.4  Dane dotyczące linii komunikacyjnych "]
["MIESIĄC",null,null,{"$f":"IF(E19=\"I KWARTAŁ\",\"MARZEC\",IF(E19=\"II KWARTAŁ\",\"CZERWIEC\",IF(E19=\"III KWARTAŁ\",\"WRZESIEŃ\",IF(E19=\"IV KWARTAŁ\",\"GRUDZIEŃ\",\"\"))))","v":"MARZEC"},null,"2026 r."]
["Lp.","Nazwa linii komunikacyjnej","Przewidywana wielkość pracy eksploatacyjnej w okresie rozliczeniowym\n[wzkm]","Cena usługi [zł]","Planowany deficyt w okresie rozliczeniowym [zł]","Część ceny usługi sfinansowana ze środków własnych organizatora [zł/wzkm]","Procentowa wartość części ceny usługi sfinansowanej ze środków własnych organizatora [%]","Kwota środków własnych organizatora [zł]","Kwota dopłaty \nw okresie rozliczeniowym \n[zł]"]
[null,1,2,3,4,5,6,7,8]
[{"$f":"A35","v":1},{"$f":"IF(B35=\"\",\"\",B35)","v":""},null,{"$f":"IFERROR(E410/C410,0)","v":0},null,{"$f":"IFERROR(H410/C410,0)","v":0},{"$f":"IFERROR(F410/D410,0)","v":0},null,{"$f":"IF(H35=\"linia nie podlega dopłacie-art. 11e\",0,'Weryfikacja 3'!S3)","v":0}]
[{"$f":"A36","v":2},{"$f":"IF(B36=\"\",\"\",B36)","v":""},null,{"$f":"IFERROR(E411/C411,0)","v":0},null,{"$f":"IFERROR(H411/C411,0)","v":0},{"$f":"IFERROR(F411/D411,0)","v":0},null,{"$f":"IF(H36=\"linia nie podlega dopłacie-art. 11e\",0,'Weryfikacja 3'!S4)","v":0}]
[3,"",null,0,null,0,0,null,{"$f":"IF(H37=\"linia nie podlega dopłacie-art. 11e\",0,'Weryfikacja 3'!S5)","v":0}]
[4,"",null,0,null,0,0,null,{"$f":"IF(H38=\"linia nie podlega dopłacie-art. 11e\",0,'Weryfikacja 3'!S6)","v":0}]
[5,"",null,0,null,0,0,null,{"$f":"IF(H39=\"linia nie podlega dopłacie-art. 11e\",0,'Weryfikacja 3'!S7)","v":0}]
[6,"",null,0,null,0,0,null,{"$f":"IF(H40=\"linia nie podlega dopłacie-art. 11e\",0,'Weryfikacja 3'!S8)","v":0}]
[7,"",null,0,null,0,0,null,{"$f":"IF(H41=\"linia nie podlega dopłacie-art. 11e\",0,'Weryfikacja 3'!S9)","v":0}]
[8,"",null,0,null,0,0,null,{"$f":"IF(H42=\"linia nie podlega dopłacie-art. 11e\",0,'Weryfikacja 3'!S10)","v":0}]
[9,"",null,0,null,0,0,null,{"$f":"IF(H43=\"linia nie podlega dopłacie-art. 11e\",0,'Weryfikacja 3'!S11)","v":0}]
[10,"",null,0,null,0,0,null,{"$f":"IF(H44=\"linia nie podlega dopłacie-art. 11e\",0,'Weryfikacja 3'!S12)","v":0}]
[11,"",null,0,null,0,0,null,{"$f":"IF(H45=\"linia nie podlega dopłacie-art. 11e\",0,'Weryfikacja 3'!S13)","v":0}]
[12,"",null,0,null,0,0,null,{"$f":"IF(H46=\"linia nie podlega dopłacie-art. 11e\",0,'Weryfikacja 3'!S14)","v":0}]
[13,"",null,0,null,0,0,null,{"$f":"IF(H47=\"linia nie podlega dopłacie-art. 11e\",0,'Weryfikacja 3'!S15)","v":0}]
[14,"",null,0,null,0,0,null,{"$f":"IF(H48=\"linia nie podlega dopłacie-art. 11e\",0,'Weryfikacja 3'!S16)","v":0}]
[15,"",null,0,null,0,0,null,{"$f":"IF(H49=\"linia nie podlega dopłacie-art. 11e\",0,'Weryfikacja 3'!S17)","v":0}]
[16,"",null,0,null,0,0,null,{"$f":"IF(H50=\"linia nie podlega dopłacie-art. 11e\",0,'Weryfikacja 3'!S18)","v":0}]
[17,"",null,0,null,0,0,null,{"$f":"IF(H51=\"linia nie podlega dopłacie-art. 11e\",0,'Weryfikacja 3'!S19)","v":0}]
[18,"",null,0,null,0,0,null,{"$f":"IF(H52=\"linia nie podlega dopłacie-art. 11e\",0,'Weryfikacja 3'!S20)","v":0}]
[19,"",null,0,null,0,0,null,{"$f":"IF(H53=\"linia nie podlega dopłacie-art. 11e\",0,'Weryfikacja 3'!S21)","v":0}]
[20,"",null,0,null,0,0,null,{"$f":"IF(H54=\"linia nie podlega dopłacie-art. 11e\",0,'Weryfikacja 3'!S22)","v":0}]
[21,"",null,0,null,0,0,null,{"$f":"IF(H55=\"linia nie podlega dopłacie-art. 11e\",0,'Weryfikacja 3'!S23)","v":0}]
[22,"",null,0,null,0,0,null,{"$f":"IF(H56=\"linia nie podlega dopłacie-art. 11e\",0,'Weryfikacja 3'!S24)","v":0}]
[23,"",null,0,null,0,0,null,{"$f":"IF(H57=\"linia nie podlega dopłacie-art. 11e\",0,'Weryfikacja 3'!S25)","v":0}]
[24,"",null,0,null,0,0,null,{"$f":"IF(H58=\"linia nie podlega dopłacie-art. 11e\",0,'Weryfikacja 3'!S26)","v":0}]
[25,"",null,0,null,0,0,null,{"$f":"IF(H59=\"linia nie podlega dopłacie-art. 11e\",0,'Weryfikacja 3'!S27)","v":0}]
[26,"",null,0,null,0,0,null,{"$f":"IF(H60=\"linia nie podlega dopłacie-art. 11e\",0,'Weryfikacja 3'!S28)","v":0}]
[27,"",null,0,null,0,0,null,{"$f":"IF(H61=\"linia nie podlega dopłacie-art. 11e\",0,'Weryfikacja 3'!S29)","v":0}]
[28,"",null,0,null,0,0,null,{"$f":"IF(H62=\"linia nie podlega dopłacie-art. 11e\",0,'Weryfikacja 3'!S30)","v":0}]
[29,"",null,0,null,0,0,null,{"$f":"IF(H63=\"linia nie podlega dopłacie-art. 11e\",0,'Weryfikacja 3'!S31)","v":0}]
[30,"",null,0,null,0,0,null,{"$f":"IF(H64=\"linia nie podlega dopłacie-art. 11e\",0,'Weryfikacja 3'!S32)","v":0}]
[31,"",null,0,null,0,0,null,{"$f":"IF(H65=\"linia nie podlega dopłacie-art. 11e\",0,'Weryfikacja 3'!S33)","v":0}]
[32,"",null,0,null,0,0,null,{"$f":"IF(H66=\"linia nie podlega dopłacie-art. 11e\",0,'Weryfikacja 3'!S34)","v":0}]
[33,"",null,0,null,0,0,null,{"$f":"IF(H67=\"linia nie podlega dopłacie-art. 11e\",0,'Weryfikacja 3'!S35)","v":0}]
[34,"",null,0,null,0,0,null,{"$f":"IF(H68=\"linia nie podlega dopłacie-art. 11e\",0,'Weryfikacja 3'!S36)","v":0}]
[35,"",null,0,null,0,0,null,{"$f":"IF(H69=\"linia nie podlega dopłacie-art. 11e\",0,'Weryfikacja 3'!S37)","v":0}]
[36,"",null,0,null,0,0,null,{"$f":"IF(H70=\"linia nie podlega dopłacie-art. 11e\",0,'Weryfikacja 3'!S38)","v":0}]
[37,"",null,0,null,0,0,null,{"$f":"IF(H71=\"linia nie podlega dopłacie-art. 11e\",0,'Weryfikacja 3'!S39)","v":0}]
[38,"",null,0,null,0,0,null,{"$f":"IF(H72=\"linia nie podlega dopłacie-art. 11e\",0,'Weryfikacja 3'!S40)","v":0}]
[39,"",null,0,null,0,0,null,{"$f":"IF(H73=\"linia nie podlega dopłacie-art. 11e\",0,'Weryfikacja 3'!S41)","v":0}]
[40,"",null,0,null,0,0,null,{"$f":"IF(H74=\"linia nie podlega dopłacie-art. 11e\",0,'Weryfikacja 3'!S42)","v":0}]
[41,"",null,0,null,0,0,null,{"$f":"IF(H75=\"linia nie podlega dopłacie-art. 11e\",0,'Weryfikacja 3'!S43)","v":0}]
[42,"",null,0,null,0,0,null,{"$f":"IF(H76=\"linia nie podlega dopłacie-art. 11e\",0,'Weryfikacja 3'!S44)","v":0}]
[43,"",null,0,null,0,0,null,{"$f":"IF(H77=\"linia nie podlega dopłacie-art. 11e\",0,'Weryfikacja 3'!S45)","v":0}]
[44,"",null,0,null,0,0,null,{"$f":"IF(H78=\"linia nie podlega dopłacie-art. 11e\",0,'Weryfikacja 3'!S46)","v":0}]
[45,"",null,0,null,0,0,null,{"$f":"IF(H79=\"linia nie podlega dopłacie-art. 11e\",0,'Weryfikacja 3'!S47)","v":0}]
[46,"",null,0,null,0,0,null,{"$f":"IF(H80=\"linia nie podlega dopłacie-art. 11e\",0,'Weryfikacja 3'!S48)","v":0}]
[47,"",null,0,null,0,0,null,{"$f":"IF(H81=\"linia nie podlega dopłacie-art. 11e\",0,'Weryfikacja 3'!S49)","v":0}]
[48,"",null,0,null,0,0,null,{"$f":"IF(H82=\"linia nie podlega dopłacie-art. 11e\",0,'Weryfikacja 3'!S50)","v":0}]
[49,"",null,0,null,0,0,null,{"$f":"IF(H83=\"linia nie podlega dopłacie-art. 11e\",0,'Weryfikacja 3'!S51)","v":0}]
[50,"",null,0,null,0,0,null,{"$f":"IF(H84=\"linia nie podlega dopłacie-art. 11e\",0,'Weryfikacja 3'!S52)","v":0}]
[51,"",null,0,null,0,0,null,{"$f":"IF(H85=\"linia nie podlega dopłacie-art. 11e\",0,'Weryfikacja 3'!S53)","v":0}]
[52,"",null,0,null,0,0,null,{"$f":"IF(H86=\"linia nie podlega dopłacie-art. 11e\",0,'Weryfikacja 3'!S54)","v":0}]
[53,"",null,0,null,0,0,null,{"$f":"IF(H87=\"linia nie podlega dopłacie-art. 11e\",0,'Weryfikacja 3'!S55)","v":0}]
[54,"",null,0,null,0,0,null,{"$f":"IF(H88=\"linia nie podlega dopłacie-art. 11e\",0,'Weryfikacja 3'!S56)","v":0}]
[55,"",null,0,null,0,0,null,{"$f":"IF(H89=\"linia nie podlega dopłacie-art. 11e\",0,'Weryfikacja 3'!S57)","v":0}]
[56,"",null,0,null,0,0,null,{"$f":"IF(H90=\"linia nie podlega dopłacie-art. 11e\",0,'Weryfikacja 3'!S58)","v":0}]
[57,"",null,0,null,0,0,null,{"$f":"IF(H91=\"linia nie podlega dopłacie-art. 11e\",0,'Weryfikacja 3'!S59)","v":0}]
[58,"",null,0,null,0,0,null,{"$f":"IF(H92=\"linia nie podlega dopłacie-art. 11e\",0,'Weryfikacja 3'!S60)","v":0}]
[59,"",null,0,null,0,0,null,{"$f":"IF(H93=\"linia nie podlega dopłacie-art. 11e\",0,'Weryfikacja 3'!S61)","v":0}]
[60,"",null,0,null,0,0,null,{"$f":"IF(H94=\"linia nie podlega dopłacie-art. 11e\",0,'Weryfikacja 3'!S62)","v":0}]
[61,"",null,0,null,0,0,null,{"$f":"IF(H95=\"linia nie podlega dopłacie-art. 11e\",0,'Weryfikacja 3'!S63)","v":0}]
[62,"",null,0,null,0,0,null,{"$f":"IF(H96=\"linia nie podlega dopłacie-art. 11e\",0,'Weryfikacja 3'!S64)","v":0}]
[63,"",null,0,null,0,0,null,{"$f":"IF(H97=\"linia nie podlega dopłacie-art. 11e\",0,'Weryfikacja 3'!S65)","v":0}]
[64,"",null,0,null,0,0,null,{"$f":"IF(H98=\"linia nie podlega dopłacie-art. 11e\",0,'Weryfikacja 3'!S66)","v":0}]
[65,"",null,0,null,0,0,null,{"$f":"IF(H99=\"linia nie podlega dopłacie-art. 11e\",0,'Weryfikacja 3'!S67)","v":0}]
[{"$f":"A100","v":66},{"$f":"IF(B100=\"\",\"\",B100)","v":""},null,{"$f":"IFERROR(E475/C475,0)","v":0},null,{"$f":"IFERROR(H475/C475,0)","v":0},{"$f":"IFERROR(F475/D475,0)","v":0},null,{"$f":"IF(H100=\"linia nie podlega dopłacie-art. 11e\",0,'Weryfikacja 3'!S68)","v":0}]
[67,"",null,0,null,0,0,null,{"$f":"IF(H101=\"linia nie podlega dopłacie-art. 11e\",0,'Weryfikacja 3'!S69)","v":0}]
[68,"",null,0,null,0,0,null,{"$f":"IF(H102=\"linia nie podlega dopłacie-art. 11e\",0,'Weryfikacja 3'!S70)","v":0}]
[69,"",null,0,null,0,0,null,{"$f":"IF(H103=\"linia nie podlega dopłacie-art. 11e\",0,'Weryfikacja 3'!S71)","v":0}]
[70,"",null,0,null,0,0,null,{"$f":"IF(H104=\"linia nie podlega dopłacie-art. 11e\",0,'Weryfikacja 3'!S72)","v":0}]
[71,"",null,0,null,0,0,null,{"$f":"IF(H105=\"linia nie podlega dopłacie-art. 11e\",0,'Weryfikacja 3'!S73)","v":0}]
[72,"",null,0,null,0,0,null,{"$f":"IF(H106=\"linia nie podlega dopłacie-art. 11e\",0,'Weryfikacja 3'!S74)","v":0}]
[73,"",null,0,null,0,0,null,{"$f":"IF(H107=\"linia nie podlega dopłacie-art. 11e\",0,'Weryfikacja 3'!S75)","v":0}]
[74,"",null,0,null,0,0,null,{"$f":"IF(H108=\"linia nie podlega dopłacie-art. 11e\",0,'Weryfikacja 3'!S76)","v":0}]
[75,"",null,0,null,0,0,null,{"$f":"IF(H109=\"linia nie podlega dopłacie-art. 11e\",0,'Weryfikacja 3'!S77)","v":0}]
[76,"",null,0,null,0,0,null,{"$f":"IF(H110=\"linia nie podlega dopłacie-art. 11e\",0,'Weryfikacja 3'!S78)","v":0}]
[77,"",null,0,null,0,0,null,{"$f":"IF(H111=\"linia nie podlega dopłacie-art. 11e\",0,'Weryfikacja 3'!S79)","v":0}]
[78,"",null,0,null,0,0,null,{"$f":"IF(H112=\"linia nie podlega dopłacie-art. 11e\",0,'Weryfikacja 3'!S80)","v":0}]
[79,"",null,0,null,0,0,null,{"$f":"IF(H113=\"linia nie podlega dopłacie-art. 11e\",0,'Weryfikacja 3'!S81)","v":0}]
[80,"",null,0,null,0,0,null,{"$f":"IF(H114=\"linia nie podlega dopłacie-art. 11e\",0,'Weryfikacja 3'!S82)","v":0}]
[81,"",null,0,null,0,0,null,{"$f":"IF(H115=\"linia nie podlega dopłacie-art. 11e\",0,'Weryfikacja 3'!S83)","v":0}]
[82,"",null,0,null,0,0,null,{"$f":"IF(H116=\"linia nie podlega dopłacie-art. 11e\",0,'Weryfikacja 3'!S84)","v":0}]
[83,"",null,0,null,0,0,null,{"$f":"IF(H117=\"linia nie podlega dopłacie-art. 11e\",0,'Weryfikacja 3'!S85)","v":0}]
[84,"",null,0,null,0,0,null,{"$f":"IF(H118=\"linia nie podlega dopłacie-art. 11e\",0,'Weryfikacja 3'!S86)","v":0}]
[85,"",null,0,null,0,0,null,{"$f":"IF(H119=\"linia nie podlega dopłacie-art. 11e\",0,'Weryfikacja 3'!S87)","v":0}]
[86,"",null,0,null,0,0,null,{"$f":"IF(H120=\"linia nie podlega dopłacie-art. 11e\",0,'Weryfikacja 3'!S88)","v":0}]
[87,"",null,0,null,0,0,null,{"$f":"IF(H121=\"linia nie podlega dopłacie-art. 11e\",0,'Weryfikacja 3'!S89)","v":0}]
[88,"",null,0,null,0,0,null,{"$f":"IF(H122=\"linia nie podlega dopłacie-art. 11e\",0,'Weryfikacja 3'!S90)","v":0}]
[89,"",null,0,null,0,0,null,{"$f":"IF(H123=\"linia nie podlega dopłacie-art. 11e\",0,'Weryfikacja 3'!S91)","v":0}]
[90,"",null,0,null,0,0,null,{"$f":"IF(H124=\"linia nie podlega dopłacie-art. 11e\",0,'Weryfikacja 3'!S92)","v":0}]
[91,"",null,0,null,0,0,null,{"$f":"IF(H125=\"linia nie podlega dopłacie-art. 11e\",0,'Weryfikacja 3'!S93)","v":0}]
[92,"",null,0,null,0,0,null,{"$f":"IF(H126=\"linia nie podlega dopłacie-art. 11e\",0,'Weryfikacja 3'!S94)","v":0}]
[93,"",null,0,null,0,0,null,{"$f":"IF(H127=\"linia nie podlega dopłacie-art. 11e\",0,'Weryfikacja 3'!S95)","v":0}]
[94,"",null,0,null,0,0,null,{"$f":"IF(H128=\"linia nie podlega dopłacie-art. 11e\",0,'Weryfikacja 3'!S96)","v":0}]
[95,"",null,0,null,0,0,null,{"$f":"IF(H129=\"linia nie podlega dopłacie-art. 11e\",0,'Weryfikacja 3'!S97)","v":0}]
[96,"",null,0,null,0,0,null,{"$f":"IF(H130=\"linia nie podlega dopłacie-art. 11e\",0,'Weryfikacja 3'!S98)","v":0}]
[97,"",null,0,null,0,0,null,{"$f":"IF(H131=\"linia nie podlega dopłacie-art. 11e\",0,'Weryfikacja 3'!S99)","v":0}]
[98,"",null,0,null,0,0,null,{"$f":"IF(H132=\"linia nie podlega dopłacie-art. 11e\",0,'Weryfikacja 3'!S100)","v":0}]
[99,"",null,0,null,0,0,null,{"$f":"IF(H133=\"linia nie podlega dopłacie-art. 11e\",0,'Weryfikacja 3'!S101)","v":0}]
[100,"",null,0,null,0,0,null,{"$f":"IF(H134=\"linia nie podlega dopłacie-art. 11e\",0,'Weryfikacja 3'!S102)","v":0}]
[101,"",null,0,null,0,0,null,{"$f":"IF(H135=\"linia nie podlega dopłacie-art. 11e\",0,'Weryfikacja 3'!S103)","v":0}]
[102,"",null,0,null,0,0,null,{"$f":"IF(H136=\"linia nie podlega dopłacie-art. 11e\",0,'Weryfikacja 3'!S104)","v":0}]
[103,"",null,0,null,0,0,null,{"$f":"IF(H137=\"linia nie podlega dopłacie-art. 11e\",0,'Weryfikacja 3'!S105)","v":0}]
[104,"",null,0,null,0,0,null,{"$f":"IF(H138=\"linia nie podlega dopłacie-art. 11e\",0,'Weryfikacja 3'!S106)","v":0}]
[105,"",null,0,null,0,0,null,{"$f":"IF(H139=\"linia nie podlega dopłacie-art. 11e\",0,'Weryfikacja 3'!S107)","v":0}]
[106,"",null,0,null,0,0,null,{"$f":"IF(H140=\"linia nie podlega dopłacie-art. 11e\",0,'Weryfikacja 3'!S108)","v":0}]
[107,"",null,0,null,0,0,null,{"$f":"IF(H141=\"linia nie podlega dopłacie-art. 11e\",0,'Weryfikacja 3'!S109)","v":0}]
[108,"",null,0,null,0,0,null,{"$f":"IF(H142=\"linia nie podlega dopłacie-art. 11e\",0,'Weryfikacja 3'!S110)","v":0}]
[109,"",null,0,null,0,0,null,{"$f":"IF(H143=\"linia nie podlega dopłacie-art. 11e\",0,'Weryfikacja 3'!S111)","v":0}]
[110,"",null,0,null,0,0,null,{"$f":"IF(H144=\"linia nie podlega dopłacie-art. 11e\",0,'Weryfikacja 3'!S112)","v":0}]
[111,"",null,0,null,0,0,null,{"$f":"IF(H145=\"linia nie podlega dopłacie-art. 11e\",0,'Weryfikacja 3'!S113)","v":0}]
[112,"",null,0,null,0,0,null,{"$f":"IF(H146=\"linia nie podlega dopłacie-art. 11e\",0,'Weryfikacja 3'!S114)","v":0}]
[113,"",null,0,null,0,0,null,{"$f":"IF(H147=\"linia nie podlega dopłacie-art. 11e\",0,'Weryfikacja 3'!S115)","v":0}]
[114,"",null,0,null,0,0,null,{"$f":"IF(H148=\"linia nie podlega dopłacie-art. 11e\",0,'Weryfikacja 3'!S116)","v":0}]
[115,"",null,0,null,0,0,null,{"$f":"IF(H149=\"linia nie podlega dopłacie-art. 11e\",0,'Weryfikacja 3'!S117)","v":0}]
["Ogółem:",null,{"$f":"SUM(C410:C524)","v":0},null,{"$f":"SUM(E410:E524)","v":0},null,null,{"$f":"SUM(H410:H524)","v":0},{"$f":"SUMIF(I410:I524,\">0\")","v":0}]
[]
["Tabele B.2 - B.4 proszę wypełnić zgodnie z wytycznymi podanymi poniżej:\nKolumna nr 1\nOznaczenie, które pozwala wyodrębnić daną linię komunikacyjną np. nazwa lub numer. Proszę wskazać wyłącznie linie komunikacyjne na które organizator zawarł umowę o dopłatę o której mowa w tabeli A.3 pkt. 1.\nKolumna nr 2\nProszę wskazać pracę ekspoloatacyjną  w okresie rozliczeniowym na danej linii komunikacyjnej. Pracę eksploatacyjną należy wyrazić w wozokilometrach (1 wozokilometr to przejazd 1 autobusu na odległość 1 kilometra).\nKolumna nr 3\nCena usługi - kwota deficytu pojedyńczej linii komunikacyjnej w przewozach autobusowych o charakterze użyteczności publicznej wyrażona w złotych w odniesieniu do 1 wozokilometra (zgodnie z art 2 ust.1 ustawy o Funduszu) Wartość obliczy się automatycznie po wypełnieniu kolumny 2 i 4.\nKolumna 4\nProszę wskazać deficyt danej linii komunikacyjnej w okresie rozliczeniowym. Kwota deficytu pojedynczej linii komunikacyjnej w przewozach autobusowych o charakterze użyteczności publicznej - ujemny wynik finansowy netto wyliczony dla tej linii nieuwzględniający rozsądnego zysku, o których mowa w rozporządzeniu (WE) 1370/2007 Parlamentu Europejskiego i Rady z dnia 23 października 2007 r. dotyczącym usług publicznych w zakresie kolejowego i drogowego transportu pasażerskiego oraz uchylającym rozporządzenie Rady (EWG) nr 1191/69 i (EWG) nr 1107/70 (Dz. Urz. UE L 315 z 03.12.2007, str. 1, z późn. zm.) \nKolumna 5\nCzęść ceny usługi (wskazanej w kol.3) finansowana przez organizatora publicznego transportu zbiorowego (nie mniej niż 10%).Wartość obliczy się automatycznie po wypełnieniu kolumny 2 i 7.\nKolumna 6\nProcentową wartość części ceny usługi sfinansowanej ze środków własnych organizatora publicznego transportu zbiorowego (nie mniej niż 10 %) Kolumna wypełni się automatycznie po wskazaniu pozostałych danych. Kolor różowy  z czerwonymi cyframi oznacza wprowadzenie zbyt niskiej wartości w kol nr 7 (brak min. 10 % )\nKolumna 7\nProszę wskazać kwotę środków własnych organizatora na danej linii komunikacyjnej w okresie rozliczeniowym. Kolor żółty oznacza, że kwota dopłaty oraz środków własnych nie pokrywa deficytu wskazanego w kol. nr 4\nKolumna 8\nKwota dopłaty do danej linii komunikacyjnej w okresie rozliczeniowym. Wyliczając kwotę dopłaty proszę mieć na uwadze:  pracę eksploatacyjną (kol. 2), deficyt w okresie rozliczeniowym (kol.4),część ceny usługi sfinansowanej ze środków własnych organizatora (kol.5 i kol.7) oraz maksymalną kwotę dopłaty do 1 wzkm. W roku budżetowym 2026 maksymalna kwota dopłaty do 1 wozokliometra  wynosi nie więcej niż 3 zł. Arkusz wskazuje  maksymalną kwotę dopłaty na podstawie wprowadzonych danych.\nUwaga - jeśli w części A.4 wniosku pojawia się informacja \"linia nie podlega dopłacie-art. 11e\"  oznacza to, że wskzano datę uruchomienia linii komunikacyjnej późniejszą niz data wskazana we wniosku o objęcie dopłatą. Taka linia zgodnie z art 11e ustawy o Funduszu rozwoju przewozów autobusowych nie podlega dofinansowaniu ze środków Funduszu w danym roku budżetowym."]
[null,null,null,null,null,null,null,null,"ver. 3.0"]
[]
["B.2 Oświadczenie"]
["Oświadczam, że dane zawarte w załączniku są kompletne i zgodne ze stanem faktycznym na dzień złożenia wniosku. Zobowiązuje sie do rozliczenia dopłaty przekazanej w oparciu o wielkości prognozowane  w terminie 30 dni, licząc od ostatniego dnia okresu rozliczeniowego, w którym przekazano środki dopłaty. Rozliczenie bedzie dotyczyć również dodatniego wyniku finansowego osiągniętego na każdej z linii komunikacyjnych w przewozach autobusowych o charakterze użyteczności publicznej objętych umową o dopłatę, który nie został uwzględniony we wcześniejszych wnioskach o dopłatę, zgodnie z art. 14 ust 4 ustawy z dnia 16 maja 2019 r. o Funduszu rozwoju przewozów autobusowych o charakterze użyteczności publicznej (Dz. U. z 2024 r. poz. 402 ze zm.)."]
[]
["Kwota środków dopłaty niewykorzystanych z rozliczenia poprzedniego okresu rozliczeniowego:",null,null,null,null,null,null,{"$f":"G26","v":0},"zł"]
["Kwota środków dopłaty w bieżącym okresie rozliczeniowym:",null,null,null,null,null,null,{"$f":"ROUND(I525+I404+I283,2)","v":0},"zł"]
["Kwota dopłaty pomniejszona o środki niewykorzystane w poprzednim okresie rozliczeniowym:",null,null,null,null,null,null,{"$f":"ROUND(H534-H533,2)","v":0},"zł"]
["Uwzględniając powyższe, proszę o przekazanie dopłaty z Funduszu rozwoju przewozów autobusowych  w wysokości:",null,null,null,null,null,null,{"$f":"H535","v":0},"zł"]
[]
[]
[]
[null,null,null,"dane osób działających w imieniu organizatora publicznego transportu zbiorowego składających kwalifikowany podpis elektroniczny pod wnioskiem "]
[]
[null,null,null,"kontrasygnata Skarbnika/Głównego księgowego budżetu  - dane osoby składającej kwalifikowany podpis elektroniczny"]
[]
[]
[null,"Termin składania wniosków za",null,{"$f":"IF(E19=\"\",\"\",E19)","v":"I KWARTAŁ"},"upływa",{"$f":"IF(E19=\"I KWARTAŁ\",Miesiące!H2,IF(E19=Miesiące!A3,Miesiące!H3,IF(E19=Miesiące!A4,Miesiące!H4,IF(E19=Miesiące!A5,Miesiące!H5,\"\"))))","v":"30.01.2026 r."}]
[null,null," Termin rozliczenia kwartału  upływa",null,null,{"$f":"IF(E19=Miesiące!A2,Miesiące!J2,IF(E19=Miesiące!A3,Miesiące!J3,IF(E19=Miesiące!A4,Miesiące!J4,IF(E19=Miesiące!A5,Miesiące!J5,\"\"))))","v":"30.04.2026 r."}]
["Uwagi - wypełnić w przypadku korekty wniosku:"]

{"sheet":"Weryfikacja 1","index":1,"n_rows":118,"n_cols":32,"rows_kept":118,"cut":false,"hidden":true,"merged":[[0,1,0,9]]}
[null,"Dane z wniosku",null,null,null,null,null,null,null,null,"ok","Wer.",null,null,null,null,null,null,null,null,null,null,null,null,null,null,null,null,null,null,null,"Zgodność danych z załącznikiem nr 1"]
["l.p","NAZWA LINII","WOZOKILOMETRY","DEFICYT","CENA USŁUGI","WKŁAD WŁASNY/KM [ZŁ]","WKŁAD WŁASNY [%]","WKŁAD WŁASNY [ZŁ]","KWOTA DOPŁATY","STAWKA MAX Z UMOWY","X",{"$f":"A2","v":"l.p"},"Cena usługi","Wkład własny/km [zł]","Wkład własny [%]","Wkład własny [zł]","Def z ceny usł","Kwota dopłaty","Max kwota dopł na podst wk. wł.","Max kwota dopł na podst wk wł/wzkm ","Kwota dopłaty/wozokm","10% z deficytu ","10 % z ceny usługi","warunek 10%","max 1 (3) zł/wzkm","Różnica w finansowaniu","Różnica def z zaokrągleń",{"$f":"Wniosek!F33","v":"Data uruchomienia linii komunikacyjnej wskazana we wniosku o objęcie dopłatą."},{"$f":"Wniosek!G33","v":"Data uruchomienia linii komunikacyjnej."},"art. 11e",null,{"$f":"IF(Miesiące!P11=Wniosek!Q213,'Weryfikacja 1'!$K$1,'Weryfikacja 1'!$K$2)","v":"ok"}]
[{"$f":"Wniosek!A168","v":1},{"$f":"Wniosek!B168","v":""},{"$f":"Wniosek!C168","v":0},{"$f":"ROUND(Wniosek!E168,2)","v":0},{"$f":"Wniosek!D168","v":0},{"$f":"Wniosek!F168","v":0},{"$f":"Wniosek!G168","v":0},{"$f":"Wniosek!H168","v":0},{"$f":"Wniosek!I168","v":0},3,null,1,{"$f":"IFERROR(D3/C3,0)","v":0},{"$f":"F3","v":0},{"$f":"IFERROR(N3/M3,0)","v":0},{"$f":"ROUND(N3*C3,2)","v":0},{"$f":"E3*C3","v":0},{"$f":"IFERROR(ROUND(T3*C3,2),0)","v":0},{"$f":"ROUND(T3*C3,2)","v":0},{"$f":"IFERROR(IF((D3-H3)/C3>=$J$3,$J$3,(D3-H3)/C3),0)","v":0},{"$f":"IFERROR(ROUND(I3/C3,2),0)","v":0},{"$f":"D3*0.1","v":0},{"$f":"M3*0.1","v":0},{"$f":"IF(N3>=W3,$K$1,$K$2)","v":"ok"},{"$f":"IF(U3<=$J$3,$K$1,$K$2)","v":"ok"},{"$f":"(R3+P3)-D3","v":0},{"$f":"ROUND(D3-Q3,2)","v":0},{"$f":"Wniosek!F35","v":"00:00:00"},{"$f":"Wniosek!G35","v":"00:00:00"},{"$f":"Wniosek!H35","v":""}]
[{"$f":"Wniosek!A169","v":2},{"$f":"Wniosek!B169","v":""},{"$f":"Wniosek!C169","v":0},{"$f":"ROUND(Wniosek!E169,2)","v":0},{"$f":"Wniosek!D169","v":0},{"$f":"Wniosek!F169","v":0},{"$f":"Wniosek!G169","v":0},{"$f":"Wniosek!H169","v":0},{"$f":"Wniosek!I169","v":0},null,null,{"$f":"A4","v":2},{"$f":"IFERROR(D4/C4,0)","v":0},{"$f":"F4","v":0},{"$f":"IFERROR(N4/M4,0)","v":0},{"$f":"ROUND(N4*C4,2)","v":0},{"$f":"E4*C4","v":0},{"$f":"IFERROR(ROUND(T4*C4,2),0)","v":0},{"$f":"ROUND(T4*C4,2)","v":0},{"$f":"IFERROR(IF((D4-H4)/C4>=$J$3,$J$3,(D4-H4)/C4),0)","v":0},{"$f":"IFERROR(ROUND(I4/C4,2),0)","v":0},{"$f":"D4*0.1","v":0},{"$f":"M4*0.1","v":0},{"$f":"IF(N4>=W4,$K$1,$K$2)","v":"ok"},{"$f":"IF(U4<=$J$3,$K$1,$K$2)","v":"ok"},{"$f":"(R4+P4)-D4","v":0},{"$f":"ROUND(D4-Q4,2)","v":0},{"$f":"Wniosek!F36","v":"00:00:00"},{"$f":"Wniosek!G36","v":"00:00:00"},{"$f":"Wniosek!H36","v":""}]
[{"$f":"Wniosek!A170","v":3},{"$f":"Wniosek!B170","v":""},{"$f":"Wniosek!C170","v":0},{"$f":"ROUND(Wniosek!E170,2)","v":0},{"$f":"Wniosek!D170","v":0},{"$f":"Wniosek!F170","v":0},{"$f":"Wniosek!G170","v":0},{"$f":"Wniosek!H170","v":0},{"$f":"Wniosek!I170","v":0},null,null,3,0,0,0,0,0,0,0,0,0,0,0,"ok","ok",0,0,{"$f":"Wniosek!F37","v":"00:00:00"},{"$f":"Wniosek!G37","v":"00:00:00"},{"$f":"Wniosek!H37","v":""}]
[{"$f":"Wniosek!A171","v":4},{"$f":"Wniosek!B171","v":""},{"$f":"Wniosek!C171","v":0},{"$f":"ROUND(Wniosek!E171,2)","v":0},{"$f":"Wniosek!D171","v":0},{"$f":"Wniosek!F171","v":0},{"$f":"Wniosek!G171","v":0},{"$f":"Wniosek!H171","v":0},{"$f":"Wniosek!I171","v":0},null,null,4,0,0,0,0,0,0,0,0,0,0,0,"ok","ok",0,0,{"$f":"Wniosek!F38","v":"00:00:00"},{"$f":"Wniosek!G38","v":"00:00:00"},{"$f":"Wniosek!H38","v":""}]
[{"$f":"Wniosek!A172","v":5},{"$f":"Wniosek!B172","v":""},{"$f":"Wniosek!C172","v":0},{"$f":"ROUND(Wniosek!E172,2)","v":0},{"$f":"Wniosek!D172","v":0},{"$f":"Wniosek!F172","v":0},{"$f":"Wniosek!G172","v":0},{"$f":"Wniosek!H172","v":0},{"$f":"Wniosek!I172","v":0},null,null,5,0,0,0,0,0,0,0,0,0,0,0,"ok","ok",0,0,{"$f":"Wniosek!F39","v":"00:00:00"},{"$f":"Wniosek!G39","v":"00:00:00"},{"$f":"Wniosek!H39","v":""}]
[{"$f":"Wniosek!A173","v":6},{"$f":"Wniosek!B173","v":""},{"$f":"Wniosek!C173","v":0},{"$f":"ROUND(Wniosek!E173,2)","v":0},{"$f":"Wniosek!D173","v":0},{"$f":"Wniosek!F173","v":0},{"$f":"Wniosek!G173","v":0},{"$f":"Wniosek!H173","v":0},{"$f":"Wniosek!I173","v":0},null,null,6,0,0,0,0,0,0,0,0,0,0,0,"ok","ok",0,0,{"$f":"Wniosek!F40","v":"00:00:00"},{"$f":"Wniosek!G40","v":"00:00:00"},{"$f":"Wniosek!H40","v":""}]
[{"$f":"Wniosek!A174","v":7},{"$f":"Wniosek!B174","v":""},{"$f":"Wniosek!C174","v":0},{"$f":"ROUND(Wniosek!E174,2)","v":0},{"$f":"Wniosek!D174","v":0},{"$f":"Wniosek!F174","v":0},{"$f":"Wniosek!G174","v":0},{"$f":"Wniosek!H174","v":0},{"$f":"Wniosek!I174","v":0},null,null,7,0,0,0,0,0,0,0,0,0,0,0,"ok","ok",0,0,{"$f":"Wniosek!F41","v":"00:00:00"},{"$f":"Wniosek!G41","v":"00:00:00"},{"$f":"Wniosek!H41","v":""}]
[{"$f":"Wniosek!A175","v":8},{"$f":"Wniosek!B175","v":""},{"$f":"Wniosek!C175","v":0},{"$f":"ROUND(Wniosek!E175,2)","v":0},{"$f":"Wniosek!D175","v":0},{"$f":"Wniosek!F175","v":0},{"$f":"Wniosek!G175","v":0},{"$f":"Wniosek!H175","v":0},{"$f":"Wniosek!I175","v":0},null,null,8,0,0,0,0,0,0,0,0,0,0,0,"ok","ok",0,0,{"$f":"Wniosek!F42","v":"00:00:00"},{"$f":"Wniosek!G42","v":"00:00:00"},{"$f":"Wniosek!H42","v":""}]
[{"$f":"Wniosek!A176","v":9},{"$f":"Wniosek!B176","v":""},{"$f":"Wniosek!C176","v":0},{"$f":"ROUND(Wniosek!E176,2)","v":0},{"$f":"Wniosek!D176","v":0},{"$f":"Wniosek!F176","v":0},{"$f":"Wniosek!G176","v":0},{"$f":"Wniosek!H176","v":0},{"$f":"Wniosek!I176","v":0},null,null,9,0,0,0,0,0,0,0,0,0,0,0,"ok","ok",0,0,{"$f":"Wniosek!F43","v":"00:00:00"},{"$f":"Wniosek!G43","v":"00:00:00"},{"$f":"Wniosek!H43","v":""}]
[{"$f":"Wniosek!A177","v":10},{"$f":"Wniosek!B177","v":""},{"$f":"Wniosek!C177","v":0},{"$f":"ROUND(Wniosek!E177,2)","v":0},{"$f":"Wniosek!D177","v":0},{"$f":"Wniosek!F177","v":0},{"$f":"Wniosek!G177","v":0},{"$f":"Wniosek!H177","v":0},{"$f":"Wniosek!I177","v":0},null,null,10,0,0,0,0,0,0,0,0,0,0,0,"ok","ok",0,0,{"$f":"Wniosek!F44","v":"00:00:00"},{"$f":"Wniosek!G44","v":"00:00:00"},{"$f":"Wniosek!H44","v":""}]
[{"$f":"Wniosek!A178","v":11},{"$f":"Wniosek!B178","v":""},{"$f":"Wniosek!C178","v":0},{"$f":"ROUND(Wniosek!E178,2)","v":0},{"$f":"Wniosek!D178","v":0},{"$f":"Wniosek!F178","v":0},{"$f":"Wniosek!G178","v":0},{"$f":"Wniosek!H178","v":0},{"$f":"Wniosek!I178","v":0},null,null,11,0,0,0,0,0,0,0,0,0,0,0,"ok","ok",0,0,{"$f":"Wniosek!F45","v":"00:00:00"},{"$f":"Wniosek!G45","v":"00:00:00"},{"$f":"Wniosek!H45","v":""}]
[{"$f":"Wniosek!A179","v":12},{"$f":"Wniosek!B179","v":""},{"$f":"Wniosek!C179","v":0},{"$f":"ROUND(Wniosek!E179,2)","v":0},{"$f":"Wniosek!D179","v":0},{"$f":"Wniosek!F179","v":0},{"$f":"Wniosek!G179","v":0},{"$f":"Wniosek!H179","v":0},{"$f":"Wniosek!I179","v":0},null,null,12,0,0,0,0,0,0,0,0,0,0,0,"ok","ok",0,0,{"$f":"Wniosek!F46","v":"00:00:00"},{"$f":"Wniosek!G46","v":"00:00:00"},{"$f":"Wniosek!H46","v":""}]
[{"$f":"Wniosek!A180","v":13},{"$f":"Wniosek!B180","v":""},{"$f":"Wniosek!C180","v":0},{"$f":"ROUND(Wniosek!E180,2)","v":0},{"$f":"Wniosek!D180","v":0},{"$f":"Wniosek!F180","v":0},{"$f":"Wniosek!G180","v":0},{"$f":"Wniosek!H180","v":0},{"$f":"Wniosek!I180","v":0},null,null,13,0,0,0,0,0,0,0,0,0,0,0,"ok","ok",0,0,{"$f":"Wniosek!F47","v":"00:00:00"},{"$f":"Wniosek!G47","v":"00:00:00"},{"$f":"Wniosek!H47","v":""}]
[{"$f":"Wniosek!A181","v":14},{"$f":"Wniosek!B181","v":""},{"$f":"Wniosek!C181","v":0},{"$f":"ROUND(Wniosek!E181,2)","v":0},{"$f":"Wniosek!D181","v":0},{"$f":"Wniosek!F181","v":0},{"$f":"Wniosek!G181","v":0},{"$f":"Wniosek!H181","v":0},{"$f":"Wniosek!I181","v":0},null,null,14,0,0,0,0,0,0,0,0,0,0,0,"ok","ok",0,0,{"$f":"Wniosek!F48","v":"00:00:00"},{"$f":"Wniosek!G48","v":"00:00:00"},{"$f":"Wniosek!H48","v":""}]
[{"$f":"Wniosek!A182","v":15},{"$f":"Wniosek!B182","v":""},{"$f":"Wniosek!C182","v":0},{"$f":"ROUND(Wniosek!E182,2)","v":0},{"$f":"Wniosek!D182","v":0},{"$f":"Wniosek!F182","v":0},{"$f":"Wniosek!G182","v":0},{"$f":"Wniosek!H182","v":0},{"$f":"Wniosek!I182","v":0},null,null,15,0,0,0,0,0,0,0,0,0,0,0,"ok","ok",0,0,{"$f":"Wniosek!F49","v":"00:00:00"},{"$f":"Wniosek!G49","v":"00:00:00"},{"$f":"Wniosek!H49","v":""}]
[{"$f":"Wniosek!A183","v":16},{"$f":"Wniosek!B183","v":""},{"$f":"Wniosek!C183","v":0},{"$f":"ROUND(Wniosek!E183,2)","v":0},{"$f":"Wniosek!D183","v":0},{"$f":"Wniosek!F183","v":0},{"$f":"Wniosek!G183","v":0},{"$f":"Wniosek!H183","v":0},{"$f":"Wniosek!I183","v":0},null,null,16,0,0,0,0,0,0,0,0,0,0,0,"ok","ok",0,0,{"$f":"Wniosek!F50","v":"00:00:00"},{"$f":"Wniosek!G50","v":"00:00:00"},{"$f":"Wniosek!H50","v":""}]
[{"$f":"Wniosek!A184","v":17},{"$f":"Wniosek!B184","v":""},{"$f":"Wniosek!C184","v":0},{"$f":"ROUND(Wniosek!E184,2)","v":0},{"$f":"Wniosek!D184","v":0},{"$f":"Wniosek!F184","v":0},{"$f":"Wniosek!G184","v":0},{"$f":"Wniosek!H184","v":0},{"$f":"Wniosek!I184","v":0},null,null,17,0,0,0,0,0,0,0,0,0,0,0,"ok","ok",0,0,{"$f":"Wniosek!F51","v":"00:00:00"},{"$f":"Wniosek!G51","v":"00:00:00"},{"$f":"Wniosek!H51","v":""}]
[{"$f":"Wniosek!A185","v":18},{"$f":"Wniosek!B185","v":""},{"$f":"Wniosek!C185","v":0},{"$f":"ROUND(Wniosek!E185,2)","v":0},{"$f":"Wniosek!D185","v":0},{"$f":"Wniosek!F185","v":0},{"$f":"Wniosek!G185","v":0},{"$f":"Wniosek!H185","v":0},{"$f":"Wniosek!I185","v":0},null,null,18,0,0,0,0,0,0,0,0,0,0,0,"ok","ok",0,0,{"$f":"Wniosek!F52","v":"00:00:00"},{"$f":"Wniosek!G52","v":"00:00:00"},{"$f":"Wniosek!H52","v":""}]
[{"$f":"Wniosek!A186","v":19},{"$f":"Wniosek!B186","v":""},{"$f":"Wniosek!C186","v":0},{"$f":"ROUND(Wniosek!E186,2)","v":0},{"$f":"Wniosek!D186","v":0},{"$f":"Wniosek!F186","v":0},{"$f":"Wniosek!G186","v":0},{"$f":"Wniosek!H186","v":0},{"$f":"Wniosek!I186","v":0},null,null,19,0,0,0,0,0,0,0,0,0,0,0,"ok","ok",0,0,{"$f":"Wniosek!F53","v":"00:00:00"},{"$f":"Wniosek!G53","v":"00:00:00"},{"$f":"Wniosek!H53","v":""}]
[{"$f":"Wniosek!A187","v":20},{"$f":"Wniosek!B187","v":""},{"$f":"Wniosek!C187","v":0},{"$f":"ROUND(Wniosek!E187,2)","v":0},{"$f":"Wniosek!D187","v":0},{"$f":"Wniosek!F187","v":0},{"$f":"Wniosek!G187","v":0},{"$f":"Wniosek!H187","v":0},{"$f":"Wniosek!I187","v":0},null,null,20,0,0,0,0,0,0,0,0,0,0,0,"ok","ok",0,0,{"$f":"Wniosek!F54","v":"00:00:00"},{"$f":"Wniosek!G54","v":"00:00:00"},{"$f":"Wniosek!H54","v":""}]
[{"$f":"Wniosek!A188","v":21},{"$f":"Wniosek!B188","v":""},{"$f":"Wniosek!C188","v":0},{"$f":"ROUND(Wniosek!E188,2)","v":0},{"$f":"Wniosek!D188","v":0},{"$f":"Wniosek!F188","v":0},{"$f":"Wniosek!G188","v":0},{"$f":"Wniosek!H188","v":0},{"$f":"Wniosek!I188","v":0},null,null,21,0,0,0,0,0,0,0,0,0,0,0,"ok","ok",0,0,{"$f":"Wniosek!F55","v":"00:00:00"},{"$f":"Wniosek!G55","v":"00:00:00"},{"$f":"Wniosek!H55","v":""}]
[{"$f":"Wniosek!A189","v":22},{"$f":"Wniosek!B189","v":""},{"$f":"Wniosek!C189","v":0},{"$f":"ROUND(Wniosek!E189,2)","v":0},{"$f":"Wniosek!D189","v":0},{"$f":"Wniosek!F189","v":0},{"$f":"Wniosek!G189","v":0},{"$f":"Wniosek!H189","v":0},{"$f":"Wniosek!I189","v":0},null,null,22,0,0,0,0,0,0,0,0,0,0,0,"ok","ok",0,0,{"$f":"Wniosek!F56","v":"00:00:00"},{"$f":"Wniosek!G56","v":"00:00:00"},{"$f":"Wniosek!H56","v":""}]
[{"$f":"Wniosek!A190","v":23},{"$f":"Wniosek!B190","v":""},{"$f":"Wniosek!C190","v":0},{"$f":"ROUND(Wniosek!E190,2)","v":0},{"$f":"Wniosek!D190","v":0},{"$f":"Wniosek!F190","v":0},{"$f":"Wniosek!G190","v":0},{"$f":"Wniosek!H190","v":0},{"$f":"Wniosek!I190","v":0},null,null,23,0,0,0,0,0,0,0,0,0,0,0,"ok","ok",0,0,{"$f":"Wniosek!F57","v":"00:00:00"},{"$f":"Wniosek!G57","v":"00:00:00"},{"$f":"Wniosek!H57","v":""}]
[{"$f":"Wniosek!A191","v":24},{"$f":"Wniosek!B191","v":""},{"$f":"Wniosek!C191","v":0},{"$f":"ROUND(Wniosek!E191,2)","v":0},{"$f":"Wniosek!D191","v":0},{"$f":"Wniosek!F191","v":0},{"$f":"Wniosek!G191","v":0},{"$f":"Wniosek!H191","v":0},{"$f":"Wniosek!I191","v":0},null,null,24,0,0,0,0,0,0,0,0,0,0,0,"ok","ok",0,0,{"$f":"Wniosek!F58","v":"00:00:00"},{"$f":"Wniosek!G58","v":"00:00:00"},{"$f":"Wniosek!H58","v":""}]
[{"$f":"Wniosek!A192","v":25},{"$f":"Wniosek!B192","v":""},{"$f":"Wniosek!C192","v":0},{"$f":"ROUND(Wniosek!E192,2)","v":0},{"$f":"Wniosek!D192","v":0},{"$f":"Wniosek!F192","v":0},{"$f":"Wniosek!G192","v":0},{"$f":"Wniosek!H192","v":0},{"$f":"Wniosek!I192","v":0},null,null,25,0,0,0,0,0,0,0,0,0,0,0,"ok","ok",0,0,{"$f":"Wniosek!F59","v":"00:00:00"},{"$f":"Wniosek!G59","v":"00:00:00"},{"$f":"Wniosek!H59","v":""}]
[{"$f":"Wniosek!A193","v":26},{"$f":"Wniosek!B193","v":""},{"$f":"Wniosek!C193","v":0},{"$f":"ROUND(Wniosek!E193,2)","v":0},{"$f":"Wniosek!D193","v":0},{"$f":"Wniosek!F193","v":0},{"$f":"Wniosek!G193","v":0},{"$f":"Wniosek!H193","v":0},{"$f":"Wniosek!I193","v":0},null,null,26,0,0,0,0,0,0,0,0,0,0,0,"ok","ok",0,0,{"$f":"Wniosek!F60","v":"00:00:00"},{"$f":"Wniosek!G60","v":"00:00:00"},{"$f":"Wniosek!H60","v":""}]
[{"$f":"Wniosek!A194","v":27},{"$f":"Wniosek!B194","v":""},{"$f":"Wniosek!C194","v":0},{"$f":"ROUND(Wniosek!E194,2)","v":0},{"$f":"Wniosek!D194","v":0},{"$f":"Wniosek!F194","v":0},{"$f":"Wniosek!G194","v":0},{"$f":"Wniosek!H194","v":0},{"$f":"Wniosek!I194","v":0},null,null,27,0,0,0,0,0,0,0,0,0,0,0,"ok","ok",0,0,{"$f":"Wniosek!F61","v":"00:00:00"},{"$f":"Wniosek!G61","v":"00:00:00"},{"$f":"Wniosek!H61","v":""}]
[{"$f":"Wniosek!A195","v":28},{"$f":"Wniosek!B195","v":""},{"$f":"Wniosek!C195","v":0},{"$f":"ROUND(Wniosek!E195,2)","v":0},{"$f":"Wniosek!D195","v":0},{"$f":"Wniosek!F195","v":0},{"$f":"Wniosek!G195","v":0},{"$f":"Wniosek!H195","v":0},{"$f":"Wniosek!I195","v":0},null,null,28,0,0,0,0,0,0,0,0,0,0,0,"ok","ok",0,0,{"$f":"Wniosek!F62","v":"00:00:00"},{"$f":"Wniosek!G62","v":"00:00:00"},{"$f":"Wniosek!H62","v":""}]
[{"$f":"Wniosek!A196","v":29},{"$f":"Wniosek!B196","v":""},{"$f":"Wniosek!C196","v":0},{"$f":"ROUND(Wniosek!E196,2)","v":0},{"$f":"Wniosek!D196","v":0},{"$f":"Wniosek!F196","v":0},{"$f":"Wniosek!G196","v":0},{"$f":"Wniosek!H196","v":0},{"$f":"Wniosek!I196","v":0},null,null,29,0,0,0,0,0,0,0,0,0,0,0,"ok","ok",0,0,{"$f":"Wniosek!F63","v":"00:00:00"},{"$f":"Wniosek!G63","v":"00:00:00"},{"$f":"Wniosek!H63","v":""}]
[{"$f":"Wniosek!A197","v":30},{"$f":"Wniosek!B197","v":""},{"$f":"Wniosek!C197","v":0},{"$f":"ROUND(Wniosek!E197,2)","v":0},{"$f":"Wniosek!D197","v":0},{"$f":"Wniosek!F197","v":0},{"$f":"Wniosek!G197","v":0},{"$f":"Wniosek!H197","v":0},{"$f":"Wniosek!I197","v":0},null,null,30,0,0,0,0,0,0,0,0,0,0,0,"ok","ok",0,0,{"$f":"Wniosek!F64","v":"00:00:00"},{"$f":"Wniosek!G64","v":"00:00:00"},{"$f":"Wniosek!H64","v":""}]
[{"$f":"Wniosek!A198","v":31},{"$f":"Wniosek!B198","v":""},{"$f":"Wniosek!C198","v":0},{"$f":"ROUND(Wniosek!E198,2)","v":0},{"$f":"Wniosek!D198","v":0},{"$f":"Wniosek!F198","v":0},{"$f":"Wniosek!G198","v":0},{"$f":"Wniosek!H198","v":0},{"$f":"Wniosek!I198","v":0},null,null,31,0,0,0,0,0,0,0,0,0,0,0,"ok","ok",0,0,{"$f":"Wniosek!F65","v":"00:00:00"},{"$f":"Wniosek!G65","v":"00:00:00"},{"$f":"Wniosek!H65","v":""}]
[{"$f":"Wniosek!A199","v":32},{"$f":"Wniosek!B199","v":""},{"$f":"Wniosek!C199","v":0},{"$f":"ROUND(Wniosek!E199,2)","v":0},{"$f":"Wniosek!D199","v":0},{"$f":"Wniosek!F199","v":0},{"$f":"Wniosek!G199","v":0},{"$f":"Wniosek!H199","v":0},{"$f":"Wniosek!I199","v":0},null,null,32,0,0,0,0,0,0,0,0,0,0,0,"ok","ok",0,0,{"$f":"Wniosek!F66","v":"00:00:00"},{"$f":"Wniosek!G66","v":"00:00:00"},{"$f":"Wniosek!H66","v":""}]
[{"$f":"Wniosek!A200","v":33},{"$f":"Wniosek!B200","v":""},{"$f":"Wniosek!C200","v":0},{"$f":"ROUND(Wniosek!E200,2)","v":0},{"$f":"Wniosek!D200","v":0},{"$f":"Wniosek!F200","v":0},{"$f":"Wniosek!G200","v":0},{"$f":"Wniosek!H200","v":0},{"$f":"Wniosek!I200","v":0},null,null,33,0,0,0,0,0,0,0,0,0,0,0,"ok","ok",0,0,{"$f":"Wniosek!F67","v":"00:00:00"},{"$f":"Wniosek!G67","v":"00:00:00"},{"$f":"Wniosek!H67","v":""}]
[{"$f":"Wniosek!A201","v":34},{"$f":"Wniosek!B201","v":""},{"$f":"Wniosek!C201","v":0},{"$f":"ROUND(Wniosek!E201,2)","v":0},{"$f":"Wniosek!D201","v":0},{"$f":"Wniosek!F201","v":0},{"$f":"Wniosek!G201","v":0},{"$f":"Wniosek!H201","v":0},{"$f":"Wniosek!I201","v":0},null,null,34,0,0,0,0,0,0,0,0,0,0,0,"ok","ok",0,0,{"$f":"Wniosek!F68","v":"00:00:00"},{"$f":"Wniosek!G68","v":"00:00:00"},{"$f":"Wniosek!H68","v":""}]
[{"$f":"Wniosek!A202","v":35},{"$f":"Wniosek!B202","v":""},{"$f":"Wniosek!C202","v":0},{"$f":"ROUND(Wniosek!E202,2)","v":0},{"$f":"Wniosek!D202","v":0},{"$f":"Wniosek!F202","v":0},{"$f":"Wniosek!G202","v":0},{"$f":"Wniosek!H202","v":0},{"$f":"Wniosek!I202","v":0},null,null,35,0,0,0,0,0,0,0,0,0,0,0,"ok","ok",0,0,{"$f":"Wniosek!F69","v":"00:00:00"},{"$f":"Wniosek!G69","v":"00:00:00"},{"$f":"Wniosek!H69","v":""}]
[{"$f":"Wniosek!A203","v":36},{"$f":"Wniosek!B203","v":""},{"$f":"Wniosek!C203","v":0},{"$f":"ROUND(Wniosek!E203,2)","v":0},{"$f":"Wniosek!D203","v":0},{"$f":"Wniosek!F203","v":0},{"$f":"Wniosek!G203","v":0},{"$f":"Wniosek!H203","v":0},{"$f":"Wniosek!I203","v":0},null,null,36,0,0,0,0,0,0,0,0,0,0,0,"ok","ok",0,0,{"$f":"Wniosek!F70","v":"00:00:00"},{"$f":"Wniosek!G70","v":"00:00:00"},{"$f":"Wniosek!H70","v":""}]
[{"$f":"Wniosek!A204","v":37},{"$f":"Wniosek!B204","v":""},{"$f":"Wniosek!C204","v":0},{"$f":"ROUND(Wniosek!E204,2)","v":0},{"$f":"Wniosek!D204","v":0},{"$f":"Wniosek!F204","v":0},{"$f":"Wniosek!G204","v":0},{"$f":"Wniosek!H204","v":0},{"$f":"Wniosek!I204","v":0},null,null,37,0,0,0,0,0,0,0,0,0,0,0,"ok","ok",0,0,{"$f":"Wniosek!F71","v":"00:00:00"},{"$f":"Wniosek!G71","v":"00:00:00"},{"$f":"Wniosek!H71","v":""}]
[{"$f":"Wniosek!A205","v":38},{"$f":"Wniosek!B205","v":""},{"$f":"Wniosek!C205","v":0},{"$f":"ROUND(Wniosek!E205,2)","v":0},{"$f":"Wniosek!D205","v":0},{"$f":"Wniosek!F205","v":0},{"$f":"Wniosek!G205","v":0},{"$f":"Wniosek!H205","v":0},{"$f":"Wniosek!I205","v":0},null,null,38,0,0,0,0,0,0,0,0,0,0,0,"ok","ok",0,0,{"$f":"Wniosek!F72","v":"00:00:00"},{"$f":"Wniosek!G72","v":"00:00:00"},{"$f":"Wniosek!H72","v":""}]
[{"$f":"Wniosek!A206","v":39},{"$f":"Wniosek!B206","v":""},{"$f":"Wniosek!C206","v":0},{"$f":"ROUND(Wniosek!E206,2)","v":0},{"$f":"Wniosek!D206","v":0},{"$f":"Wniosek!F206","v":0},{"$f":"Wniosek!G206","v":0},{"$f":"Wniosek!H206","v":0},{"$f":"Wniosek!I206","v":0},null,null,39,0,0,0,0,0,0,0,0,0,0,0,"ok","ok",0,0,{"$f":"Wniosek!F73","v":"00:00:00"},{"$f":"Wniosek!G73","v":"00:00:00"},{"$f":"Wniosek!H73","v":""}]
[{"$f":"Wniosek!A207","v":40},{"$f":"Wniosek!B207","v":""},{"$f":"Wniosek!C207","v":0},{"$f":"ROUND(Wniosek!E207,2)","v":0},{"$f":"Wniosek!D207","v":0},{"$f":"Wniosek!F207","v":0},{"$f":"Wniosek!G207","v":0},{"$f":"Wniosek!H207","v":0},{"$f":"Wniosek!I207","v":0},null,null,40,0,0,0,0,0,0,0,0,0,0,0,"ok","ok",0,0,{"$f":"Wniosek!F74","v":"00:00:00"},{"$f":"Wniosek!G74","v":"00:00:00"},{"$f":"Wniosek!H74","v":""}]
[{"$f":"Wniosek!A208","v":41},{"$f":"Wniosek!B208","v":""},{"$f":"Wniosek!C208","v":0},{"$f":"ROUND(Wniosek!E208,2)","v":0},{"$f":"Wniosek!D208","v":0},{"$f":"Wniosek!F208","v":0},{"$f":"Wniosek!G208","v":0},{"$f":"Wniosek!H208","v":0},{"$f":"Wniosek!I208","v":0},null,null,41,0,0,0,0,0,0,0,0,0,0,0,"ok","ok",0,0,{"$f":"Wniosek!F75","v":"00:00:00"},{"$f":"Wniosek!G75","v":"00:00:00"},{"$f":"Wniosek!H75","v":""}]
[{"$f":"Wniosek!A209","v":42},{"$f":"Wniosek!B209","v":""},{"$f":"Wniosek!C209","v":0},{"$f":"ROUND(Wniosek!E209,2)","v":0},{"$f":"Wniosek!D209","v":0},{"$f":"Wniosek!F209","v":0},{"$f":"Wniosek!G209","v":0},{"$f":"Wniosek!H209","v":0},{"$f":"Wniosek!I209","v":0},null,null,42,0,0,0,0,0,0,0,0,0,0,0,"ok","ok",0,0,{"$f":"Wniosek!F76","v":"00:00:00"},{"$f":"Wniosek!G76","v":"00:00:00"},{"$f":"Wniosek!H76","v":""}]
[{"$f":"Wniosek!A210","v":43},{"$f":"Wniosek!B210","v":""},{"$f":"Wniosek!C210","v":0},{"$f":"ROUND(Wniosek!E210,2)","v":0},{"$f":"Wniosek!D210","v":0},{"$f":"Wniosek!F210","v":0},{"$f":"Wniosek!G210","v":0},{"$f":"Wniosek!H210","v":0},{"$f":"Wniosek!I210","v":0},null,null,43,0,0,0,0,0,0,0,0,0,0,0,"ok","ok",0,0,{"$f":"Wniosek!F77","v":"00:00:00"},{"$f":"Wniosek!G77","v":"00:00:00"},{"$f":"Wniosek!H77","v":""}]
[{"$f":"Wniosek!A211","v":44},{"$f":"Wniosek!B211","v":""},{"$f":"Wniosek!C211","v":0},{"$f":"ROUND(Wniosek!E211,2)","v":0},{"$f":"Wniosek!D211","v":0},{"$f":"Wniosek!F211","v":0},{"$f":"Wniosek!G211","v":0},{"$f":"Wniosek!H211","v":0},{"$f":"Wniosek!I211","v":0},null,null,44,0,0,0,0,0,0,0,0,0,0,0,"ok","ok",0,0,{"$f":"Wniosek!F78","v":"00:00:00"},{"$f":"Wniosek!G78","v":"00:00:00"},{"$f":"Wniosek!H78","v":""}]
[{"$f":"Wniosek!A212","v":45},{"$f":"Wniosek!B212","v":""},{"$f":"Wniosek!C212","v":0},{"$f":"ROUND(Wniosek!E212,2)","v":0},{"$f":"Wniosek!D212","v":0},{"$f":"Wniosek!F212","v":0},{"$f":"Wniosek!G212","v":0},{"$f":"Wniosek!H212","v":0},{"$f":"Wniosek!I212","v":0},null,null,45,0,0,0,0,0,0,0,0,0,0,0,"ok","ok",0,0,{"$f":"Wniosek!F79","v":"00:00:00"},{"$f":"Wniosek!G79","v":"00:00:00"},{"$f":"Wniosek!H79","v":""}]
[{"$f":"Wniosek!A213","v":46},{"$f":"Wniosek!B213","v":""},{"$f":"Wniosek!C213","v":0},{"$f":"ROUND(Wniosek!E213,2)","v":0},{"$f":"Wniosek!D213","v":0},{"$f":"Wniosek!F213","v":0},{"$f":"Wniosek!G213","v":0},{"$f":"Wniosek!H213","v":0},{"$f":"Wniosek!I213","v":0},null,null,46,0,0,0,0,0,0,0,0,0,0,0,"ok","ok",0,0,{"$f":"Wniosek!F80","v":"00:00:00"},{"$f":"Wniosek!G80","v":"00:00:00"},{"$f":"Wniosek!H80","v":""}]
[{"$f":"Wniosek!A214","v":47},{"$f":"Wniosek!B214","v":""},{"$f":"Wniosek!C214","v":0},{"$f":"ROUND(Wniosek!E214,2)","v":0},{"$f":"Wniosek!D214","v":0},{"$f":"Wniosek!F214","v":0},{"$f":"Wniosek!G214","v":0},{"$f":"Wniosek!H214","v":0},{"$f":"Wniosek!I214","v":0},null,null,47,0,0,0,0,0,0,0,0,0,0,0,"ok","ok",0,0,{"$f":"Wniosek!F81","v":"00:00:00"},{"$f":"Wniosek!G81","v":"00:00:00"},{"$f":"Wniosek!H81","v":""}]
[{"$f":"Wniosek!A215","v":48},{"$f":"Wniosek!B215","v":""},{"$f":"Wniosek!C215","v":0},{"$f":"ROUND(Wniosek!E215,2)","v":0},{"$f":"Wniosek!D215","v":0},{"$f":"Wniosek!F215","v":0},{"$f":"Wniosek!G215","v":0},{"$f":"Wniosek!H215","v":0},{"$f":"Wniosek!I215","v":0},null,null,48,0,0,0,0,0,0,0,0,0,0,0,"ok","ok",0,0,{"$f":"Wniosek!F82","v":"00:00:00"},{"$f":"Wniosek!G82","v":"00:00:00"},{"$f":"Wniosek!H82","v":""}]
[{"$f":"Wniosek!A216","v":49},{"$f":"Wniosek!B216","v":""},{"$f":"Wniosek!C216","v":0},{"$f":"ROUND(Wniosek!E216,2)","v":0},{"$f":"Wniosek!D216","v":0},{"$f":"Wniosek!F216","v":0},{"$f":"Wniosek!G216","v":0},{"$f":"Wniosek!H216","v":0},{"$f":"Wniosek!I216","v":0},null,null,49,0,0,0,0,0,0,0,0,0,0,0,"ok","ok",0,0,{"$f":"Wniosek!F83","v":"00:00:00"},{"$f":"Wniosek!G83","v":"00:00:00"},{"$f":"Wniosek!H83","v":""}]
[{"$f":"Wniosek!A217","v":50},{"$f":"Wniosek!B217","v":""},{"$f":"Wniosek!C217","v":0},{"$f":"ROUND(Wniosek!E217,2)","v":0},{"$f":"Wniosek!D217","v":0},{"$f":"Wniosek!F217","v":0},{"$f":"Wniosek!G217","v":0},{"$f":"Wniosek!H217","v":0},{"$f":"Wniosek!I217","v":0},null,null,50,0,0,0,0,0,0,0,0,0,0,0,"ok","ok",0,0,{"$f":"Wniosek!F84","v":"00:00:00"},{"$f":"Wniosek!G84","v":"00:00:00"},{"$f":"Wniosek!H84","v":""}]
[{"$f":"Wniosek!A218","v":51},{"$f":"Wniosek!B218","v":""},{"$f":"Wniosek!C218","v":0},{"$f":"ROUND(Wniosek!E218,2)","v":0},{"$f":"Wniosek!D218","v":0},{"$f":"Wniosek!F218","v":0},{"$f":"Wniosek!G218","v":0},{"$f":"Wniosek!H218","v":0},{"$f":"Wniosek!I218","v":0},null,null,51,0,0,0,0,0,0,0,0,0,0,0,"ok","ok",0,0,{"$f":"Wniosek!F85","v":"00:00:00"},{"$f":"Wniosek!G85","v":"00:00:00"},{"$f":"Wniosek!H85","v":""}]
[{"$f":"Wniosek!A219","v":52},{"$f":"Wniosek!B219","v":""},{"$f":"Wniosek!C219","v":0},{"$f":"ROUND(Wniosek!E219,2)","v":0},{"$f":"Wniosek!D219","v":0},{"$f":"Wniosek!F219","v":0},{"$f":"Wniosek!G219","v":0},{"$f":"Wniosek!H219","v":0},{"$f":"Wniosek!I219","v":0},null,null,52,0,0,0,0,0,0,0,0,0,0,0,"ok","ok",0,0,{"$f":"Wniosek!F86","v":"00:00:00"},{"$f":"Wniosek!G86","v":"00:00:00"},{"$f":"Wniosek!H86","v":""}]
[{"$f":"Wniosek!A220","v":53},{"$f":"Wniosek!B220","v":""},{"$f":"Wniosek!C220","v":0},{"$f":"ROUND(Wniosek!E220,2)","v":0},{"$f":"Wniosek!D220","v":0},{"$f":"Wniosek!F220","v":0},{"$f":"Wniosek!G220","v":0},{"$f":"Wniosek!H220","v":0},{"$f":"Wniosek!I220","v":0},null,null,53,0,0,0,0,0,0,0,0,0,0,0,"ok","ok",0,0,{"$f":"Wniosek!F87","v":"00:00:00"},{"$f":"Wniosek!G87","v":"00:00:00"},{"$f":"Wniosek!H87","v":""}]
[{"$f":"Wniosek!A221","v":54},{"$f":"Wniosek!B221","v":""},{"$f":"Wniosek!C221","v":0},{"$f":"ROUND(Wniosek!E221,2)","v":0},{"$f":"Wniosek!D221","v":0},{"$f":"Wniosek!F221","v":0},{"$f":"Wniosek!G221","v":0},{"$f":"Wniosek!H221","v":0},{"$f":"Wniosek!I221","v":0},null,null,54,0,0,0,0,0,0,0,0,0,0,0,"ok","ok",0,0,{"$f":"Wniosek!F88","v":"00:00:00"},{"$f":"Wniosek!G88","v":"00:00:00"},{"$f":"Wniosek!H88","v":""}]
[{"$f":"Wniosek!A222","v":55},{"$f":"Wniosek!B222","v":""},{"$f":"Wniosek!C222","v":0},{"$f":"ROUND(Wniosek!E222,2)","v":0},{"$f":"Wniosek!D222","v":0},{"$f":"Wniosek!F222","v":0},{"$f":"Wniosek!G222","v":0},{"$f":"Wniosek!H222","v":0},{"$f":"Wniosek!I222","v":0},null,null,55,0,0,0,0,0,0,0,0,0,0,0,"ok","ok",0,0,{"$f":"Wniosek!F89","v":"00:00:00"},{"$f":"Wniosek!G89","v":"00:00:00"},{"$f":"Wniosek!H89","v":""}]
[{"$f":"Wniosek!A223","v":56},{"$f":"Wniosek!B223","v":""},{"$f":"Wniosek!C223","v":0},{"$f":"ROUND(Wniosek!E223,2)","v":0},{"$f":"Wniosek!D223","v":0},{"$f":"Wniosek!F223","v":0},{"$f":"Wniosek!G223","v":0},{"$f":"Wniosek!H223","v":0},{"$f":"Wniosek!I223","v":0},null,null,56,0,0,0,0,0,0,0,0,0,0,0,"ok","ok",0,0,{"$f":"Wniosek!F90","v":"00:00:00"},{"$f":"Wniosek!G90","v":"00:00:00"},{"$f":"Wniosek!H90","v":""}]
[{"$f":"Wniosek!A224","v":57},{"$f":"Wniosek!B224","v":""},{"$f":"Wniosek!C224","v":0},{"$f":"ROUND(Wniosek!E224,2)","v":0},{"$f":"Wniosek!D224","v":0},{"$f":"Wniosek!F224","v":0},{"$f":"Wniosek!G224","v":0},{"$f":"Wniosek!H224","v":0},{"$f":"Wniosek!I224","v":0},null,null,57,0,0,0,0,0,0,0,0,0,0,0,"ok","ok",0,0,{"$f":"Wniosek!F91","v":"00:00:00"},{"$f":"Wniosek!G91","v":"00:00:00"},{"$f":"Wniosek!H91","v":""}]
[{"$f":"Wniosek!A225","v":58},{"$f":"Wniosek!B225","v":""},{"$f":"Wniosek!C225","v":0},{"$f":"ROUND(Wniosek!E225,2)","v":0},{"$f":"Wniosek!D225","v":0},{"$f":"Wniosek!F225","v":0},{"$f":"Wniosek!G225","v":0},{"$f":"Wniosek!H225","v":0},{"$f":"Wniosek!I225","v":0},null,null,58,0,0,0,0,0,0,0,0,0,0,0,"ok","ok",0,0,{"$f":"Wniosek!F92","v":"00:00:00"},{"$f":"Wniosek!G92","v":"00:00:00"},{"$f":"Wniosek!H92","v":""}]
[{"$f":"Wniosek!A226","v":59},{"$f":"Wniosek!B226","v":""},{"$f":"Wniosek!C226","v":0},{"$f":"ROUND(Wniosek!E226,2)","v":0},{"$f":"Wniosek!D226","v":0},{"$f":"Wniosek!F226","v":0},{"$f":"Wniosek!G226","v":0},{"$f":"Wniosek!H226","v":0},{"$f":"Wniosek!I226","v":0},null,null,59,0,0,0,0,0,0,0,0,0,0,0,"ok","ok",0,0,{"$f":"Wniosek!F93","v":"00:00:00"},{"$f":"Wniosek!G93","v":"00:00:00"},{"$f":"Wniosek!H93","v":""}]
[{"$f":"Wniosek!A227","v":60},{"$f":"Wniosek!B227","v":""},{"$f":"Wniosek!C227","v":0},{"$f":"ROUND(Wniosek!E227,2)","v":0},{"$f":"Wniosek!D227","v":0},{"$f":"Wniosek!F227","v":0},{"$f":"Wniosek!G227","v":0},{"$f":"Wniosek!H227","v":0},{"$f":"Wniosek!I227","v":0},null,null,60,0,0,0,0,0,0,0,0,0,0,0,"ok","ok",0,0,{"$f":"Wniosek!F94","v":"00:00:00"},{"$f":"Wniosek!G94","v":"00:00:00"},{"$f":"Wniosek!H94","v":""}]
[{"$f":"Wniosek!A228","v":61},{"$f":"Wniosek!B228","v":""},{"$f":"Wniosek!C228","v":0},{"$f":"ROUND(Wniosek!E228,2)","v":0},{"$f":"Wniosek!D228","v":0},{"$f":"Wniosek!F228","v":0},{"$f":"Wniosek!G228","v":0},{"$f":"Wniosek!H228","v":0},{"$f":"Wniosek!I228","v":0},null,null,61,0,0,0,0,0,0,0,0,0,0,0,"ok","ok",0,0,{"$f":"Wniosek!F95","v":"00:00:00"},{"$f":"Wniosek!G95","v":"00:00:00"},{"$f":"Wniosek!H95","v":""}]
[{"$f":"Wniosek!A229","v":62},{"$f":"Wniosek!B229","v":""},{"$f":"Wniosek!C229","v":0},{"$f":"ROUND(Wniosek!E229,2)","v":0},{"$f":"Wniosek!D229","v":0},{"$f":"Wniosek!F229","v":0},{"$f":"Wniosek!G229","v":0},{"$f":"Wniosek!H229","v":0},{"$f":"Wniosek!I229","v":0},null,null,62,0,0,0,0,0,0,0,0,0,0,0,"ok","ok",0,0,{"$f":"Wniosek!F96","v":"00:00:00"},{"$f":"Wniosek!G96","v":"00:00:00"},{"$f":"Wniosek!H96","v":""}]
[{"$f":"Wniosek!A230","v":63},{"$f":"Wniosek!B230","v":""},{"$f":"Wniosek!C230","v":0},{"$f":"ROUND(Wniosek!E230,2)","v":0},{"$f":"Wniosek!D230","v":0},{"$f":"Wniosek!F230","v":0},{"$f":"Wniosek!G230","v":0},{"$f":"Wniosek!H230","v":0},{"$f":"Wniosek!I230","v":0},null,null,63,0,0,0,0,0,0,0,0,0,0,0,"ok","ok",0,0,{"$f":"Wniosek!F97","v":"00:00:00"},{"$f":"Wniosek!G97","v":"00:00:00"},{"$f":"Wniosek!H97","v":""}]
[{"$f":"Wniosek!A231","v":64},{"$f":"Wniosek!B231","v":""},{"$f":"Wniosek!C231","v":0},{"$f":"ROUND(Wniosek!E231,2)","v":0},{"$f":"Wniosek!D231","v":0},{"$f":"Wniosek!F231","v":0},{"$f":"Wniosek!G231","v":0},{"$f":"Wniosek!H231","v":0},{"$f":"Wniosek!I231","v":0},null,null,64,0,0,0,0,0,0,0,0,0,0,0,"ok","ok",0,0,{"$f":"Wniosek!F98","v":"00:00:00"},{"$f":"Wniosek!G98","v":"00:00:00"},{"$f":"Wniosek!H98","v":""}]
[{"$f":"Wniosek!A232","v":65},{"$f":"Wniosek!B232","v":""},{"$f":"Wniosek!C232","v":0},{"$f":"ROUND(Wniosek!E232,2)","v":0},{"$f":"Wniosek!D232","v":0},{"$f":"Wniosek!F232","v":0},{"$f":"Wniosek!G232","v":0},{"$f":"Wniosek!H232","v":0},{"$f":"Wniosek!I232","v":0},null,null,65,0,0,0,0,0,0,0,0,0,0,0,"ok","ok",0,0,{"$f":"Wniosek!F99","v":"00:00:00"},{"$f":"Wniosek!G99","v":"00:00:00"},{"$f":"Wniosek!H99","v":""}]
[{"$f":"Wniosek!A233","v":66},{"$f":"Wniosek!B233","v":""},{"$f":"Wniosek!C233","v":0},{"$f":"ROUND(Wniosek!E233,2)","v":0},{"$f":"Wniosek!D233","v":0},{"$f":"Wniosek!F233","v":0},{"$f":"Wniosek!G233","v":0},{"$f":"Wniosek!H233","v":0},{"$f":"Wniosek!I233","v":0},null,null,{"$f":"A68","v":66},{"$f":"IFERROR(D68/C68,0)","v":0},{"$f":"F68","v":0},{"$f":"IFERROR(N68/M68,0)","v":0},{"$f":"ROUND(N68*C68,2)","v":0},{"$f":"E68*C68","v":0},{"$f":"IFERROR(ROUND(T68*C68,2),0)","v":0},{"$f":"ROUND(T68*C68,2)","v":0},{"$f":"IFERROR(IF((D68-H68)/C68>=$J$3,$J$3,(D68-H68)/C68),0)","v":0},{"$f":"IFERROR(ROUND(I68/C68,2),0)","v":0},{"$f":"D68*0.1","v":0},{"$f":"M68*0.1","v":0},{"$f":"IF(N68>=W68,$K$1,$K$2)","v":"ok"},{"$f":"IF(U68<=$J$3,$K$1,$K$2)","v":"ok"},{"$f":"(R68+P68)-D68","v":0},{"$f":"ROUND(D68-Q68,2)","v":0},{"$f":"Wniosek!F100","v":"00:00:00"},{"$f":"Wniosek!G100","v":"00:00:00"},{"$f":"Wniosek!H100","v":""}]
[{"$f":"Wniosek!A234","v":67},{"$f":"Wniosek!B234","v":""},{"$f":"Wniosek!C234","v":0},{"$f":"ROUND(Wniosek!E234,2)","v":0},{"$f":"Wniosek!D234","v":0},{"$f":"Wniosek!F234","v":0},{"$f":"Wniosek!G234","v":0},{"$f":"Wniosek!H234","v":0},{"$f":"Wniosek!I234","v":0},null,null,67,0,0,0,0,0,0,0,0,0,0,0,"ok","ok",0,0,{"$f":"Wniosek!F101","v":"00:00:00"},{"$f":"Wniosek!G101","v":"00:00:00"},{"$f":"Wniosek!H101","v":""}]
[{"$f":"Wniosek!A235","v":68},{"$f":"Wniosek!B235","v":""},{"$f":"Wniosek!C235","v":0},{"$f":"ROUND(Wniosek!E235,2)","v":0},{"$f":"Wniosek!D235","v":0},{"$f":"Wniosek!F235","v":0},{"$f":"Wniosek!G235","v":0},{"$f":"Wniosek!H235","v":0},{"$f":"Wniosek!I235","v":0},null,null,68,0,0,0,0,0,0,0,0,0,0,0,"ok","ok",0,0,{"$f":"Wniosek!F102","v":"00:00:00"},{"$f":"Wniosek!G102","v":"00:00:00"},{"$f":"Wniosek!H102","v":""}]
[{"$f":"Wniosek!A236","v":69},{"$f":"Wniosek!B236","v":""},{"$f":"Wniosek!C236","v":0},{"$f":"ROUND(Wniosek!E236,2)","v":0},{"$f":"Wniosek!D236","v":0},{"$f":"Wniosek!F236","v":0},{"$f":"Wniosek!G236","v":0},{"$f":"Wniosek!H236","v":0},{"$f":"Wniosek!I236","v":0},null,null,69,0,0,0,0,0,0,0,0,0,0,0,"ok","ok",0,0,{"$f":"Wniosek!F103","v":"00:00:00"},{"$f":"Wniosek!G103","v":"00:00:00"},{"$f":"Wniosek!H103","v":""}]
[{"$f":"Wniosek!A237","v":70},{"$f":"Wniosek!B237","v":""},{"$f":"Wniosek!C237","v":0},{"$f":"ROUND(Wniosek!E237,2)","v":0},{"$f":"Wniosek!D237","v":0},{"$f":"Wniosek!F237","v":0},{"$f":"Wniosek!G237","v":0},{"$f":"Wniosek!H237","v":0},{"$f":"Wniosek!I237","v":0},null,null,70,0,0,0,0,0,0,0,0,0,0,0,"ok","ok",0,0,{"$f":"Wniosek!F104","v":"00:00:00"},{"$f":"Wniosek!G104","v":"00:00:00"},{"$f":"Wniosek!H104","v":""}]
[{"$f":"Wniosek!A238","v":71},{"$f":"Wniosek!B238","v":""},{"$f":"Wniosek!C238","v":0},{"$f":"ROUND(Wniosek!E238,2)","v":0},{"$f":"Wniosek!D238","v":0},{"$f":"Wniosek!F238","v":0},{"$f":"Wniosek!G238","v":0},{"$f":"Wniosek!H238","v":0},{"$f":"Wniosek!I238","v":0},null,null,71,0,0,0,0,0,0,0,0,0,0,0,"ok","ok",0,0,{"$f":"Wniosek!F105","v":"00:00:00"},{"$f":"Wniosek!G105","v":"00:00:00"},{"$f":"Wniosek!H105","v":""}]
[{"$f":"Wniosek!A239","v":72},{"$f":"Wniosek!B239","v":""},{"$f":"Wniosek!C239","v":0},{"$f":"ROUND(Wniosek!E239,2)","v":0},{"$f":"Wniosek!D239","v":0},{"$f":"Wniosek!F239","v":0},{"$f":"Wniosek!G239","v":0},{"$f":"Wniosek!H239","v":0},{"$f":"Wniosek!I239","v":0},null,null,72,0,0,0,0,0,0,0,0,0,0,0,"ok","ok",0,0,{"$f":"Wniosek!F106","v":"00:00:00"},{"$f":"Wniosek!G106","v":"00:00:00"},{"$f":"Wniosek!H106","v":""}]
[{"$f":"Wniosek!A240","v":73},{"$f":"Wniosek!B240","v":""},{"$f":"Wniosek!C240","v":0},{"$f":"ROUND(Wniosek!E240,2)","v":0},{"$f":"Wniosek!D240","v":0},{"$f":"Wniosek!F240","v":0},{"$f":"Wniosek!G240","v":0},{"$f":"Wniosek!H240","v":0},{"$f":"Wniosek!I240","v":0},null,null,73,0,0,0,0,0,0,0,0,0,0,0,"ok","ok",0,0,{"$f":"Wniosek!F107","v":"00:00:00"},{"$f":"Wniosek!G107","v":"00:00:00"},{"$f":"Wniosek!H107","v":""}]
[{"$f":"Wniosek!A241","v":74},{"$f":"Wniosek!B241","v":""},{"$f":"Wniosek!C241","v":0},{"$f":"ROUND(Wniosek!E241,2)","v":0},{"$f":"Wniosek!D241","v":0},{"$f":"Wniosek!F241","v":0},{"$f":"Wniosek!G241","v":0},{"$f":"Wniosek!H241","v":0},{"$f":"Wniosek!I241","v":0},null,null,74,0,0,0,0,0,0,0,0,0,0,0,"ok","ok",0,0,{"$f":"Wniosek!F108","v":"00:00:00"},{"$f":"Wniosek!G108","v":"00:00:00"},{"$f":"Wniosek!H108","v":""}]
[{"$f":"Wniosek!A242","v":75},{"$f":"Wniosek!B242","v":""},{"$f":"Wniosek!C242","v":0},{"$f":"ROUND(Wniosek!E242,2)","v":0},{"$f":"Wniosek!D242","v":0},{"$f":"Wniosek!F242","v":0},{"$f":"Wniosek!G242","v":0},{"$f":"Wniosek!H242","v":0},{"$f":"Wniosek!I242","v":0},null,null,75,0,0,0,0,0,0,0,0,0,0,0,"ok","ok",0,0,{"$f":"Wniosek!F109","v":"00:00:00"},{"$f":"Wniosek!G109","v":"00:00:00"},{"$f":"Wniosek!H109","v":""}]
[{"$f":"Wniosek!A243","v":76},{"$f":"Wniosek!B243","v":""},{"$f":"Wniosek!C243","v":0},{"$f":"ROUND(Wniosek!E243,2)","v":0},{"$f":"Wniosek!D243","v":0},{"$f":"Wniosek!F243","v":0},{"$f":"Wniosek!G243","v":0},{"$f":"Wniosek!H243","v":0},{"$f":"Wniosek!I243","v":0},null,null,76,0,0,0,0,0,0,0,0,0,0,0,"ok","ok",0,0,{"$f":"Wniosek!F110","v":"00:00:00"},{"$f":"Wniosek!G110","v":"00:00:00"},{"$f":"Wniosek!H110","v":""}]
[{"$f":"Wniosek!A244","v":77},{"$f":"Wniosek!B244","v":""},{"$f":"Wniosek!C244","v":0},{"$f":"ROUND(Wniosek!E244,2)","v":0},{"$f":"Wniosek!D244","v":0},{"$f":"Wniosek!F244","v":0},{"$f":"Wniosek!G244","v":0},{"$f":"Wniosek!H244","v":0},{"$f":"Wniosek!I244","v":0},null,null,77,0,0,0,0,0,0,0,0,0,0,0,"ok","ok",0,0,{"$f":"Wniosek!F111","v":"00:00:00"},{"$f":"Wniosek!G111","v":"00:00:00"},{"$f":"Wniosek!H111","v":""}]
[{"$f":"Wniosek!A245","v":78},{"$f":"Wniosek!B245","v":""},{"$f":"Wniosek!C245","v":0},{"$f":"ROUND(Wniosek!E245,2)","v":0},{"$f":"Wniosek!D245","v":0},{"$f":"Wniosek!F245","v":0},{"$f":"Wniosek!G245","v":0},{"$f":"Wniosek!H245","v":0},{"$f":"Wniosek!I245","v":0},null,null,78,0,0,0,0,0,0,0,0,0,0,0,"ok","ok",0,0,{"$f":"Wniosek!F112","v":"00:00:00"},{"$f":"Wniosek!G112","v":"00:00:00"},{"$f":"Wniosek!H112","v":""}]
[{"$f":"Wniosek!A246","v":79},{"$f":"Wniosek!B246","v":""},{"$f":"Wniosek!C246","v":0},{"$f":"ROUND(Wniosek!E246,2)","v":0},{"$f":"Wniosek!D246","v":0},{"$f":"Wniosek!F246","v":0},{"$f":"Wniosek!G246","v":0},{"$f":"Wniosek!H246","v":0},{"$f":"Wniosek!I246","v":0},null,null,79,0,0,0,0,0,0,0,0,0,0,0,"ok","ok",0,0,{"$f":"Wniosek!F113","v":"00:00:00"},{"$f":"Wniosek!G113","v":"00:00:00"},{"$f":"Wniosek!H113","v":""}]
[{"$f":"Wniosek!A247","v":80},{"$f":"Wniosek!B247","v":""},{"$f":"Wniosek!C247","v":0},{"$f":"ROUND(Wniosek!E247,2)","v":0},{"$f":"Wniosek!D247","v":0},{"$f":"Wniosek!F247","v":0},{"$f":"Wniosek!G247","v":0},{"$f":"Wniosek!H247","v":0},{"$f":"Wniosek!I247","v":0},null,null,80,0,0,0,0,0,0,0,0,0,0,0,"ok","ok",0,0,{"$f":"Wniosek!F114","v":"00:00:00"},{"$f":"Wniosek!G114","v":"00:00:00"},{"$f":"Wniosek!H114","v":""}]
[{"$f":"Wniosek!A248","v":81},{"$f":"Wniosek!B248","v":""},{"$f":"Wniosek!C248","v":0},{"$f":"ROUND(Wniosek!E248,2)","v":0},{"$f":"Wniosek!D248","v":0},{"$f":"Wniosek!F248","v":0},{"$f":"Wniosek!G248","v":0},{"$f":"Wniosek!H248","v":0},{"$f":"Wniosek!I248","v":0},null,null,81,0,0,0,0,0,0,0,0,0,0,0,"ok","ok",0,0,{"$f":"Wniosek!F115","v":"00:00:00"},{"$f":"Wniosek!G115","v":"00:00:00"},{"$f":"Wniosek!H115","v":""}]
[{"$f":"Wniosek!A249","v":82},{"$f":"Wniosek!B249","v":""},{"$f":"Wniosek!C249","v":0},{"$f":"ROUND(Wniosek!E249,2)","v":0},{"$f":"Wniosek!D249","v":0},{"$f":"Wniosek!F249","v":0},{"$f":"Wniosek!G249","v":0},{"$f":"Wniosek!H249","v":0},{"$f":"Wniosek!I249","v":0},null,null,82,0,0,0,0,0,0,0,0,0,0,0,"ok","ok",0,0,{"$f":"Wniosek!F116","v":"00:00:00"},{"$f":"Wniosek!G116","v":"00:00:00"},{"$f":"Wniosek!H116","v":""}]
[{"$f":"Wniosek!A250","v":83},{"$f":"Wniosek!B250","v":""},{"$f":"Wniosek!C250","v":0},{"$f":"ROUND(Wniosek!E250,2)","v":0},{"$f":"Wniosek!D250","v":0},{"$f":"Wniosek!F250","v":0},{"$f":"Wniosek!G250","v":0},{"$f":"Wniosek!H250","v":0},{"$f":"Wniosek!I250","v":0},null,null,83,0,0,0,0,0,0,0,0,0,0,0,"ok","ok",0,0,{"$f":"Wniosek!F117","v":"00:00:00"},{"$f":"Wniosek!G117","v":"00:00:00"},{"$f":"Wniosek!H117","v":""}]
[{"$f":"Wniosek!A251","v":84},{"$f":"Wniosek!B251","v":""},{"$f":"Wniosek!C251","v":0},{"$f":"ROUND(Wniosek!E251,2)","v":0},{"$f":"Wniosek!D251","v":0},{"$f":"Wniosek!F251","v":0},{"$f":"Wniosek!G251","v":0},{"$f":"Wniosek!H251","v":0},{"$f":"Wniosek!I251","v":0},null,null,84,0,0,0,0,0,0,0,0,0,0,0,"ok","ok",0,0,{"$f":"Wniosek!F118","v":"00:00:00"},{"$f":"Wniosek!G118","v":"00:00:00"},{"$f":"Wniosek!H118","v":""}]
[{"$f":"Wniosek!A252","v":85},{"$f":"Wniosek!B252","v":""},{"$f":"Wniosek!C252","v":0},{"$f":"ROUND(Wniosek!E252,2)","v":0},{"$f":"Wniosek!D252","v":0},{"$f":"Wniosek!F252","v":0},{"$f":"Wniosek!G252","v":0},{"$f":"Wniosek!H252","v":0},{"$f":"Wniosek!I252","v":0},null,null,85,0,0,0,0,0,0,0,0,0,0,0,"ok","ok",0,0,{"$f":"Wniosek!F119","v":"00:00:00"},{"$f":"Wniosek!G119","v":"00:00:00"},{"$f":"Wniosek!H119","v":""}]
[{"$f":"Wniosek!A253","v":86},{"$f":"Wniosek!B253","v":""},{"$f":"Wniosek!C253","v":0},{"$f":"ROUND(Wniosek!E253,2)","v":0},{"$f":"Wniosek!D253","v":0},{"$f":"Wniosek!F253","v":0},{"$f":"Wniosek!G253","v":0},{"$f":"Wniosek!H253","v":0},{"$f":"Wniosek!I253","v":0},null,null,86,0,0,0,0,0,0,0,0,0,0,0,"ok","ok",0,0,{"$f":"Wniosek!F120","v":"00:00:00"},{"$f":"Wniosek!G120","v":"00:00:00"},{"$f":"Wniosek!H120","v":""}]
[{"$f":"Wniosek!A254","v":87},{"$f":"Wniosek!B254","v":""},{"$f":"Wniosek!C254","v":0},{"$f":"ROUND(Wniosek!E254,2)","v":0},{"$f":"Wniosek!D254","v":0},{"$f":"Wniosek!F254","v":0},{"$f":"Wniosek!G254","v":0},{"$f":"Wniosek!H254","v":0},{"$f":"Wniosek!I254","v":0},null,null,87,0,0,0,0,0,0,0,0,0,0,0,"ok","ok",0,0,{"$f":"Wniosek!F121","v":"00:00:00"},{"$f":"Wniosek!G121","v":"00:00:00"},{"$f":"Wniosek!H121","v":""}]
[{"$f":"Wniosek!A255","v":88},{"$f":"Wniosek!B255","v":""},{"$f":"Wniosek!C255","v":0},{"$f":"ROUND(Wniosek!E255,2)","v":0},{"$f":"Wniosek!D255","v":0},{"$f":"Wniosek!F255","v":0},{"$f":"Wniosek!G255","v":0},{"$f":"Wniosek!H255","v":0},{"$f":"Wniosek!I255","v":0},null,null,88,0,0,0,0,0,0,0,0,0,0,0,"ok","ok",0,0,{"$f":"Wniosek!F122","v":"00:00:00"},{"$f":"Wniosek!G122","v":"00:00:00"},{"$f":"Wniosek!H122","v":""}]
[{"$f":"Wniosek!A256","v":89},{"$f":"Wniosek!B256","v":""},{"$f":"Wniosek!C256","v":0},{"$f":"ROUND(Wniosek!E256,2)","v":0},{"$f":"Wniosek!D256","v":0},{"$f":"Wniosek!F256","v":0},{"$f":"Wniosek!G256","v":0},{"$f":"Wniosek!H256","v":0},{"$f":"Wniosek!I256","v":0},null,null,89,0,0,0,0,0,0,0,0,0,0,0,"ok","ok",0,0,{"$f":"Wniosek!F123","v":"00:00:00"},{"$f":"Wniosek!G123","v":"00:00:00"},{"$f":"Wniosek!H123","v":""}]
[{"$f":"Wniosek!A257","v":90},{"$f":"Wniosek!B257","v":""},{"$f":"Wniosek!C257","v":0},{"$f":"ROUND(Wniosek!E257,2)","v":0},{"$f":"Wniosek!D257","v":0},{"$f":"Wniosek!F257","v":0},{"$f":"Wniosek!G257","v":0},{"$f":"Wniosek!H257","v":0},{"$f":"Wniosek!I257","v":0},null,null,90,0,0,0,0,0,0,0,0,0,0,0,"ok","ok",0,0,{"$f":"Wniosek!F124","v":"00:00:00"},{"$f":"Wniosek!G124","v":"00:00:00"},{"$f":"Wniosek!H124","v":""}]
[{"$f":"Wniosek!A258","v":91},{"$f":"Wniosek!B258","v":""},{"$f":"Wniosek!C258","v":0},{"$f":"ROUND(Wniosek!E258,2)","v":0},{"$f":"Wniosek!D258","v":0},{"$f":"Wniosek!F258","v":0},{"$f":"Wniosek!G258","v":0},{"$f":"Wniosek!H258","v":0},{"$f":"Wniosek!I258","v":0},null,null,91,0,0,0,0,0,0,0,0,0,0,0,"ok","ok",0,0,{"$f":"Wniosek!F125","v":"00:00:00"},{"$f":"Wniosek!G125","v":"00:00:00"},{"$f":"Wniosek!H125","v":""}]
[{"$f":"Wniosek!A259","v":92},{"$f":"Wniosek!B259","v":""},{"$f":"Wniosek!C259","v":0},{"$f":"ROUND(Wniosek!E259,2)","v":0},{"$f":"Wniosek!D259","v":0},{"$f":"Wniosek!F259","v":0},{"$f":"Wniosek!G259","v":0},{"$f":"Wniosek!H259","v":0},{"$f":"Wniosek!I259","v":0},null,null,92,0,0,0,0,0,0,0,0,0,0,0,"ok","ok",0,0,{"$f":"Wniosek!F126","v":"00:00:00"},{"$f":"Wniosek!G126","v":"00:00:00"},{"$f":"Wniosek!H126","v":""}]
[{"$f":"Wniosek!A260","v":93},{"$f":"Wniosek!B260","v":""},{"$f":"Wniosek!C260","v":0},{"$f":"ROUND(Wniosek!E260,2)","v":0},{"$f":"Wniosek!D260","v":0},{"$f":"Wniosek!F260","v":0},{"$f":"Wniosek!G260","v":0},{"$f":"Wniosek!H260","v":0},{"$f":"Wniosek!I260","v":0},null,null,93,0,0,0,0,0,0,0,0,0,0,0,"ok","ok",0,0,{"$f":"Wniosek!F127","v":"00:00:00"},{"$f":"Wniosek!G127","v":"00:00:00"},{"$f":"Wniosek!H127","v":""}]
[{"$f":"Wniosek!A261","v":94},{"$f":"Wniosek!B261","v":""},{"$f":"Wniosek!C261","v":0},{"$f":"ROUND(Wniosek!E261,2)","v":0},{"$f":"Wniosek!D261","v":0},{"$f":"Wniosek!F261","v":0},{"$f":"Wniosek!G261","v":0},{"$f":"Wniosek!H261","v":0},{"$f":"Wniosek!I261","v":0},null,null,94,0,0,0,0,0,0,0,0,0,0,0,"ok","ok",0,0,{"$f":"Wniosek!F128","v":"00:00:00"},{"$f":"Wniosek!G128","v":"00:00:00"},{"$f":"Wniosek!H128","v":""}]
[{"$f":"Wniosek!A262","v":95},{"$f":"Wniosek!B262","v":""},{"$f":"Wniosek!C262","v":0},{"$f":"ROUND(Wniosek!E262,2)","v":0},{"$f":"Wniosek!D262","v":0},{"$f":"Wniosek!F262","v":0},{"$f":"Wniosek!G262","v":0},{"$f":"Wniosek!H262","v":0},{"$f":"Wniosek!I262","v":0},null,null,95,0,0,0,0,0,0,0,0,0,0,0,"ok","ok",0,0,{"$f":"Wniosek!F129","v":"00:00:00"},{"$f":"Wniosek!G129","v":"00:00:00"},{"$f":"Wniosek!H129","v":""}]
[{"$f":"Wniosek!A263","v":96},{"$f":"Wniosek!B263","v":""},{"$f":"Wniosek!C263","v":0},{"$f":"ROUND(Wniosek!E263,2)","v":0},{"$f":"Wniosek!D263","v":0},{"$f":"Wniosek!F263","v":0},{"$f":"Wniosek!G263","v":0},{"$f":"Wniosek!H263","v":0},{"$f":"Wniosek!I263","v":0},null,null,96,0,0,0,0,0,0,0,0,0,0,0,"ok","ok",0,0,{"$f":"Wniosek!F130","v":"00:00:00"},{"$f":"Wniosek!G130","v":"00:00:00"},{"$f":"Wniosek!H130","v":""}]
[{"$f":"Wniosek!A264","v":97},{"$f":"Wniosek!B264","v":""},{"$f":"Wniosek!C264","v":0},{"$f":"ROUND(Wniosek!E264,2)","v":0},{"$f":"Wniosek!D264","v":0},{"$f":"Wniosek!F264","v":0},{"$f":"Wniosek!G264","v":0},{"$f":"Wniosek!H264","v":0},{"$f":"Wniosek!I264","v":0},null,null,97,0,0,0,0,0,0,0,0,0,0,0,"ok","ok",0,0,{"$f":"Wniosek!F131","v":"00:00:00"},{"$f":"Wniosek!G131","v":"00:00:00"},{"$f":"Wniosek!H131","v":""}]
[{"$f":"Wniosek!A265","v":98},{"$f":"Wniosek!B265","v":""},{"$f":"Wniosek!C265","v":0},{"$f":"ROUND(Wniosek!E265,2)","v":0},{"$f":"Wniosek!D265","v":0},{"$f":"Wniosek!F265","v":0},{"$f":"Wniosek!G265","v":0},{"$f":"Wniosek!H265","v":0},{"$f":"Wniosek!I265","v":0},null,null,98,0,0,0,0,0,0,0,0,0,0,0,"ok","ok",0,0,{"$f":"Wniosek!F132","v":"00:00:00"},{"$f":"Wniosek!G132","v":"00:00:00"},{"$f":"Wniosek!H132","v":""}]
[{"$f":"Wniosek!A266","v":99},{"$f":"Wniosek!B266","v":""},{"$f":"Wniosek!C266","v":0},{"$f":"ROUND(Wniosek!E266,2)","v":0},{"$f":"Wniosek!D266","v":0},{"$f":"Wniosek!F266","v":0},{"$f":"Wniosek!G266","v":0},{"$f":"Wniosek!H266","v":0},{"$f":"Wniosek!I266","v":0},null,null,99,0,0,0,0,0,0,0,0,0,0,0,"ok","ok",0,0,{"$f":"Wniosek!F133","v":"00:00:00"},{"$f":"Wniosek!G133","v":"00:00:00"},{"$f":"Wniosek!H133","v":""}]
[{"$f":"Wniosek!A267","v":100},{"$f":"Wniosek!B267","v":""},{"$f":"Wniosek!C267","v":0},{"$f":"ROUND(Wniosek!E267,2)","v":0},{"$f":"Wniosek!D267","v":0},{"$f":"Wniosek!F267","v":0},{"$f":"Wniosek!G267","v":0},{"$f":"Wniosek!H267","v":0},{"$f":"Wniosek!I267","v":0},null,null,100,0,0,0,0,0,0,0,0,0,0,0,"ok","ok",0,0,{"$f":"Wniosek!F134","v":"00:00:00"},{"$f":"Wniosek!G134","v":"00:00:00"},{"$f":"Wniosek!H134","v":""}]
[{"$f":"Wniosek!A268","v":101},{"$f":"Wniosek!B268","v":""},{"$f":"Wniosek!C268","v":0},{"$f":"ROUND(Wniosek!E268,2)","v":0},{"$f":"Wniosek!D268","v":0},{"$f":"Wniosek!F268","v":0},{"$f":"Wniosek!G268","v":0},{"$f":"Wniosek!H268","v":0},{"$f":"Wniosek!I268","v":0},null,null,101,0,0,0,0,0,0,0,0,0,0,0,"ok","ok",0,0,{"$f":"Wniosek!F135","v":"00:00:00"},{"$f":"Wniosek!G135","v":"00:00:00"},{"$f":"Wniosek!H135","v":""}]
[{"$f":"Wniosek!A269","v":102},{"$f":"Wniosek!B269","v":""},{"$f":"Wniosek!C269","v":0},{"$f":"ROUND(Wniosek!E269,2)","v":0},{"$f":"Wniosek!D269","v":0},{"$f":"Wniosek!F269","v":0},{"$f":"Wniosek!G269","v":0},{"$f":"Wniosek!H269","v":0},{"$f":"Wniosek!I269","v":0},null,null,102,0,0,0,0,0,0,0,0,0,0,0,"ok","ok",0,0,{"$f":"Wniosek!F136","v":"00:00:00"},{"$f":"Wniosek!G136","v":"00:00:00"},{"$f":"Wniosek!H136","v":""}]
[{"$f":"Wniosek!A270","v":103},{"$f":"Wniosek!B270","v":""},{"$f":"Wniosek!C270","v":0},{"$f":"ROUND(Wniosek!E270,2)","v":0},{"$f":"Wniosek!D270","v":0},{"$f":"Wniosek!F270","v":0},{"$f":"Wniosek!G270","v":0},{"$f":"Wniosek!H270","v":0},{"$f":"Wniosek!I270","v":0},null,null,103,0,0,0,0,0,0,0,0,0,0,0,"ok","ok",0,0,{"$f":"Wniosek!F137","v":"00:00:00"},{"$f":"Wniosek!G137","v":"00:00:00"},{"$f":"Wniosek!H137","v":""}]
[{"$f":"Wniosek!A271","v":104},{"$f":"Wniosek!B271","v":""},{"$f":"Wniosek!C271","v":0},{"$f":"ROUND(Wniosek!E271,2)","v":0},{"$f":"Wniosek!D271","v":0},{"$f":"Wniosek!F271","v":0},{"$f":"Wniosek!G271","v":0},{"$f":"Wniosek!H271","v":0},{"$f":"Wniosek!I271","v":0},null,null,104,0,0,0,0,0,0,0,0,0,0,0,"ok","ok",0,0,{"$f":"Wniosek!F138","v":"00:00:00"},{"$f":"Wniosek!G138","v":"00:00:00"},{"$f":"Wniosek!H138","v":""}]
[{"$f":"Wniosek!A272","v":105},{"$f":"Wniosek!B272","v":""},{"$f":"Wniosek!C272","v":0},{"$f":"ROUND(Wniosek!E272,2)","v":0},{"$f":"Wniosek!D272","v":0},{"$f":"Wniosek!F272","v":0},{"$f":"Wniosek!G272","v":0},{"$f":"Wniosek!H272","v":0},{"$f":"Wniosek!I272","v":0},null,null,105,0,0,0,0,0,0,0,0,0,0,0,"ok","ok",0,0,{"$f":"Wniosek!F139","v":"00:00:00"},{"$f":"Wniosek!G139","v":"00:00:00"},{"$f":"Wniosek!H139","v":""}]
[{"$f":"Wniosek!A273","v":106},{"$f":"Wniosek!B273","v":""},{"$f":"Wniosek!C273","v":0},{"$f":"ROUND(Wniosek!E273,2)","v":0},{"$f":"Wniosek!D273","v":0},{"$f":"Wniosek!F273","v":0},{"$f":"Wniosek!G273","v":0},{"$f":"Wniosek!H273","v":0},{"$f":"Wniosek!I273","v":0},null,null,106,0,0,0,0,0,0,0,0,0,0,0,"ok","ok",0,0,{"$f":"Wniosek!F140","v":"00:00:00"},{"$f":"Wniosek!G140","v":"00:00:00"}]
[{"$f":"Wniosek!A274","v":107},{"$f":"Wniosek!B274","v":""},{"$f":"Wniosek!C274","v":0},{"$f":"ROUND(Wniosek!E274,2)","v":0},{"$f":"Wniosek!D274","v":0},{"$f":"Wniosek!F274","v":0},{"$f":"Wniosek!G274","v":0},{"$f":"Wniosek!H274","v":0},{"$f":"Wniosek!I274","v":0},null,null,107,0,0,0,0,0,0,0,0,0,0,0,"ok","ok",0,0,{"$f":"Wniosek!F141","v":"00:00:00"},{"$f":"Wniosek!G141","v":"00:00:00"}]
[{"$f":"Wniosek!A275","v":108},{"$f":"Wniosek!B275","v":""},{"$f":"Wniosek!C275","v":0},{"$f":"ROUND(Wniosek!E275,2)","v":0},{"$f":"Wniosek!D275","v":0},{"$f":"Wniosek!F275","v":0},{"$f":"Wniosek!G275","v":0},{"$f":"Wniosek!H275","v":0},{"$f":"Wniosek!I275","v":0},null,null,108,0,0,0,0,0,0,0,0,0,0,0,"ok","ok",0,0,{"$f":"Wniosek!F142","v":"00:00:00"},{"$f":"Wniosek!G142","v":"00:00:00"}]
[{"$f":"Wniosek!A276","v":109},{"$f":"Wniosek!B276","v":""},{"$f":"Wniosek!C276","v":0},{"$f":"ROUND(Wniosek!E276,2)","v":0},{"$f":"Wniosek!D276","v":0},{"$f":"Wniosek!F276","v":0},{"$f":"Wniosek!G276","v":0},{"$f":"Wniosek!H276","v":0},{"$f":"Wniosek!I276","v":0},null,null,109,0,0,0,0,0,0,0,0,0,0,0,"ok","ok",0,0,{"$f":"Wniosek!F143","v":"00:00:00"},{"$f":"Wniosek!G143","v":"00:00:00"}]
[{"$f":"Wniosek!A277","v":110},{"$f":"Wniosek!B277","v":""},{"$f":"Wniosek!C277","v":0},{"$f":"ROUND(Wniosek!E277,2)","v":0},{"$f":"Wniosek!D277","v":0},{"$f":"Wniosek!F277","v":0},{"$f":"Wniosek!G277","v":0},{"$f":"Wniosek!H277","v":0},{"$f":"Wniosek!I277","v":0},null,null,110,0,0,0,0,0,0,0,0,0,0,0,"ok","ok",0,0,{"$f":"Wniosek!F144","v":"00:00:00"},{"$f":"Wniosek!G144","v":"00:00:00"}]
[{"$f":"Wniosek!A278","v":111},{"$f":"Wniosek!B278","v":""},{"$f":"Wniosek!C278","v":0},{"$f":"ROUND(Wniosek!E278,2)","v":0},{"$f":"Wniosek!D278","v":0},{"$f":"Wniosek!F278","v":0},{"$f":"Wniosek!G278","v":0},{"$f":"Wniosek!H278","v":0},{"$f":"Wniosek!I278","v":0},null,null,111,0,0,0,0,0,0,0,0,0,0,0,"ok","ok",0,0,{"$f":"Wniosek!F145","v":"00:00:00"},{"$f":"Wniosek!G145","v":"00:00:00"},{"$f":"Wniosek!H145","v":""}]
[{"$f":"Wniosek!A279","v":112},{"$f":"Wniosek!B279","v":""},{"$f":"Wniosek!C279","v":0},{"$f":"ROUND(Wniosek!E279,2)","v":0},{"$f":"Wniosek!D279","v":0},{"$f":"Wniosek!F279","v":0},{"$f":"Wniosek!G279","v":0},{"$f":"Wniosek!H279","v":0},{"$f":"Wniosek!I279","v":0},null,null,112,0,0,0,0,0,0,0,0,0,0,0,"ok","ok",0,0,{"$f":"Wniosek!F146","v":"00:00:00"},{"$f":"Wniosek!G146","v":"00:00:00"},{"$f":"Wniosek!H146","v":""}]
[{"$f":"Wniosek!A280","v":113},{"$f":"Wniosek!B280","v":""},{"$f":"Wniosek!C280","v":0},{"$f":"ROUND(Wniosek!E280,2)","v":0},{"$f":"Wniosek!D280","v":0},{"$f":"Wniosek!F280","v":0},{"$f":"Wniosek!G280","v":0},{"$f":"Wniosek!H280","v":0},{"$f":"Wniosek!I280","v":0},null,null,113,0,0,0,0,0,0,0,0,0,0,0,"ok","ok",0,0,{"$f":"Wniosek!F147","v":"00:00:00"},{"$f":"Wniosek!G147","v":"00:00:00"},{"$f":"Wniosek!H147","v":""}]
[{"$f":"Wniosek!A281","v":114},{"$f":"Wniosek!B281","v":""},{"$f":"Wniosek!C281","v":0},{"$f":"ROUND(Wniosek!E281,2)","v":0},{"$f":"Wniosek!D281","v":0},{"$f":"Wniosek!F281","v":0},{"$f":"Wniosek!G281","v":0},{"$f":"Wniosek!H281","v":0},{"$f":"Wniosek!I281","v":0},null,null,114,0,0,0,0,0,0,0,0,0,0,0,"ok","ok",0,0,{"$f":"Wniosek!F148","v":"00:00:00"},{"$f":"Wniosek!G148","v":"00:00:00"},{"$f":"Wniosek!H148","v":""}]
[{"$f":"Wniosek!A282","v":115},{"$f":"Wniosek!B282","v":""},{"$f":"Wniosek!C282","v":0},{"$f":"ROUND(Wniosek!E282,2)","v":0},{"$f":"Wniosek!D282","v":0},{"$f":"Wniosek!F282","v":0},{"$f":"Wniosek!G282","v":0},{"$f":"Wniosek!H282","v":0},{"$f":"Wniosek!I282","v":0},null,null,115,0,0,0,0,0,0,0,0,0,0,0,"ok","ok",0,0,{"$f":"Wniosek!F149","v":"00:00:00"},{"$f":"Wniosek!G149","v":"00:00:00"},{"$f":"Wniosek!H149","v":""}]
["Suma",null,{"$f":"SUM(C3:C117)","v":0},{"$f":"ROUND(Wniosek!E283,2)","v":0},null,null,null,{"$f":"SUM(H3:H117)","v":0},{"$f":"SUMIF(I3:I117,\">0\")","v":0},null,null,null,null,null,null,{"$f":"ROUND(N118*C118,2)","v":0},{"$f":"SUM(Q3:Q117)","v":0},{"$f":"IFERROR(ROUND(T118*C118,2),0)","v":0},{"$f":"SUM(S3:S117)","v":0},null,null,{"$f":"D118*0.1","v":0}]

{"sheet":"Weryfikacja 2","index":2,"n_rows":118,"n_cols":32,"rows_kept":118,"cut":false,"hidden":true,"merged":[[0,1,0,9]]}
[null,"Dane z wniosku",null,null,null,null,null,null,null,null,"ok","Wer.",null,null,null,null,null,null,null,null,null,null,null,null,null,null,null,null,null,null,null,"Zgodność danych z załącznikiem nr 1"]
["l.p","NAZWA LINII","WOZOKILOMETRY","DEFICYT","CENA USŁUGI","WKŁAD WŁASNY/KM [ZŁ]","WKŁAD WŁASNY [%]","WKŁAD WŁASNY [ZŁ]","KWOTA DOPŁATY","STAWKA MAX Z UMOWY","X",{"$f":"A2","v":"l.p"},"Cena usługi","Wkład własny/km [zł]","Wkład własny [%]","Wkład własny [zł]","Def z ceny usł","Kwota dopłaty","Max kwota dopł na podst wk. wł.","Max kwota dopł na podst wk wł/wzkm ","Kwota dopłaty/wozokm","10% z deficytu ","10 % z ceny usługi","warunek 10%","max 1 (3) zł/wzkm","Różnica w finansowaniu","Różnica def z zaokrągleń",{"$f":"Wniosek!F33","v":"Data uruchomienia linii komunikacyjnej wskazana we wniosku o objęcie dopłatą."},{"$f":"Wniosek!G33","v":"Data uruchomienia linii komunikacyjnej."},"art. 11e",null,{"$f":"IF(Miesiące!P11=Wniosek!Q213,'Weryfikacja 2'!$K$1,'Weryfikacja 2'!$K$2)","v":"ok"}]
[{"$f":"Wniosek!A168","v":1},{"$f":"Wniosek!B289","v":""},{"$f":"Wniosek!C289","v":0},{"$f":"ROUND(Wniosek!E289,2)","v":0},{"$f":"Wniosek!D289","v":0},{"$f":"Wniosek!F289","v":0},{"$f":"Wniosek!G289","v":0},{"$f":"Wniosek!H289","v":0},{"$f":"Wniosek!I289","v":0},3,null,1,{"$f":"IFERROR(D3/C3,0)","v":0},{"$f":"F3","v":0},{"$f":"IFERROR(N3/M3,0)","v":0},{"$f":"ROUND(N3*C3,2)","v":0},{"$f":"E3*C3","v":0},{"$f":"IFERROR(ROUND(T3*C3,2),0)","v":0},{"$f":"ROUND(T3*C3,2)","v":0},{"$f":"IFERROR(IF((D3-H3)/C3>=$J$3,$J$3,(D3-H3)/C3),0)","v":0},{"$f":"IFERROR(ROUND(I3/C3,2),0)","v":0},{"$f":"D3*0.1","v":0},{"$f":"M3*0.1","v":0},{"$f":"IF(N3>=W3,$K$1,$K$2)","v":"ok"},{"$f":"IF(U3<=$J$3,$K$1,$K$2)","v":"ok"},{"$f":"(R3+P3)-D3","v":0},{"$f":"ROUND(D3-Q3,2)","v":0},{"$f":"Wniosek!F35","v":"00:00:00"},{"$f":"Wniosek!G35","v":"00:00:00"},{"$f":"Wniosek!H35","v":""}]
[{"$f":"Wniosek!A169","v":2},{"$f":"Wniosek!B290","v":""},{"$f":"Wniosek!C290","v":0},{"$f":"ROUND(Wniosek!E290,2)","v":0},{"$f":"Wniosek!D290","v":0},{"$f":"Wniosek!F290","v":0},{"$f":"Wniosek!G290","v":0},{"$f":"Wniosek!H290","v":0},{"$f":"Wniosek!I290","v":0},null,null,{"$f":"A4","v":2},{"$f":"IFERROR(D4/C4,0)","v":0},{"$f":"F4","v":0},{"$f":"IFERROR(N4/M4,0)","v":0},{"$f":"ROUND(N4*C4,2)","v":0},{"$f":"E4*C4","v":0},{"$f":"IFERROR(ROUND(T4*C4,2),0)","v":0},{"$f":"ROUND(T4*C4,2)","v":0},{"$f":"IFERROR(IF((D4-H4)/C4>=$J$3,$J$3,(D4-H4)/C4),0)","v":0},{"$f":"IFERROR(ROUND(I4/C4,2),0)","v":0},{"$f":"D4*0.1","v":0},{"$f":"M4*0.1","v":0},{"$f":"IF(N4>=W4,$K$1,$K$2)","v":"ok"},{"$f":"IF(U4<=$J$3,$K$1,$K$2)","v":"ok"},{"$f":"(R4+P4)-D4","v":0},{"$f":"ROUND(D4-Q4,2)","v":0},{"$f":"Wniosek!F36","v":"00:00:00"},{"$f":"Wniosek!G36","v":"00:00:00"},{"$f":"Wniosek!H36","v":""}]
[{"$f":"Wniosek!A170","v":3},{"$f":"Wniosek!B291","v":""},{"$f":"Wniosek!C291","v":0},{"$f":"ROUND(Wniosek!E291,2)","v":0},{"$f":"Wniosek!D291","v":0},{"$f":"Wniosek!F291","v":0},{"$f":"Wniosek!G291","v":0},{"$f":"Wniosek!H291","v":0},{"$f":"Wniosek!I291","v":0},null,null,3,0,0,0,0,0,0,0,0,0,0,0,"ok","ok",0,0,{"$f":"Wniosek!F37","v":"00:00:00"},{"$f":"Wniosek!G37","v":"00:00:00"},{"$f":"Wniosek!H37","v":""}]
[{"$f":"Wniosek!A171","v":4},{"$f":"Wniosek!B292","v":""},{"$f":"Wniosek!C292","v":0},{"$f":"ROUND(Wniosek!E292,2)","v":0},{"$f":"Wniosek!D292","v":0},{"$f":"Wniosek!F292","v":0},{"$f":"Wniosek!G292","v":0},{"$f":"Wniosek!H292","v":0},{"$f":"Wniosek!I292","v":0},null,null,4,0,0,0,0,0,0,0,0,0,0,0,"ok","ok",0,0,{"$f":"Wniosek!F38","v":"00:00:00"},{"$f":"Wniosek!G38","v":"00:00:00"},{"$f":"Wniosek!H38","v":""}]
[{"$f":"Wniosek!A172","v":5},{"$f":"Wniosek!B293","v":""},{"$f":"Wniosek!C293","v":0},{"$f":"ROUND(Wniosek!E293,2)","v":0},{"$f":"Wniosek!D293","v":0},{"$f":"Wniosek!F293","v":0},{"$f":"Wniosek!G293","v":0},{"$f":"Wniosek!H293","v":0},{"$f":"Wniosek!I293","v":0},null,null,5,0,0,0,0,0,0,0,0,0,0,0,"ok","ok",0,0,{"$f":"Wniosek!F39","v":"00:00:00"},{"$f":"Wniosek!G39","v":"00:00:00"},{"$f":"Wniosek!H39","v":""}]
[{"$f":"Wniosek!A173","v":6},{"$f":"Wniosek!B294","v":""},{"$f":"Wniosek!C294","v":0},{"$f":"ROUND(Wniosek!E294,2)","v":0},{"$f":"Wniosek!D294","v":0},{"$f":"Wniosek!F294","v":0},{"$f":"Wniosek!G294","v":0},{"$f":"Wniosek!H294","v":0},{"$f":"Wniosek!I294","v":0},null,null,6,0,0,0,0,0,0,0,0,0,0,0,"ok","ok",0,0,{"$f":"Wniosek!F40","v":"00:00:00"},{"$f":"Wniosek!G40","v":"00:00:00"},{"$f":"Wniosek!H40","v":""}]
[{"$f":"Wniosek!A174","v":7},{"$f":"Wniosek!B295","v":""},{"$f":"Wniosek!C295","v":0},{"$f":"ROUND(Wniosek!E295,2)","v":0},{"$f":"Wniosek!D295","v":0},{"$f":"Wniosek!F295","v":0},{"$f":"Wniosek!G295","v":0},{"$f":"Wniosek!H295","v":0},{"$f":"Wniosek!I295","v":0},null,null,7,0,0,0,0,0,0,0,0,0,0,0,"ok","ok",0,0,{"$f":"Wniosek!F41","v":"00:00:00"},{"$f":"Wniosek!G41","v":"00:00:00"},{"$f":"Wniosek!H41","v":""}]
[{"$f":"Wniosek!A175","v":8},{"$f":"Wniosek!B296","v":""},{"$f":"Wniosek!C296","v":0},{"$f":"ROUND(Wniosek!E296,2)","v":0},{"$f":"Wniosek!D296","v":0},{"$f":"Wniosek!F296","v":0},{"$f":"Wniosek!G296","v":0},{"$f":"Wniosek!H296","v":0},{"$f":"Wniosek!I296","v":0},null,null,8,0,0,0,0,0,0,0,0,0,0,0,"ok","ok",0,0,{"$f":"Wniosek!F42","v":"00:00:00"},{"$f":"Wniosek!G42","v":"00:00:00"},{"$f":"Wniosek!H42","v":""}]
[{"$f":"Wniosek!A176","v":9},{"$f":"Wniosek!B297","v":""},{"$f":"Wniosek!C297","v":0},{"$f":"ROUND(Wniosek!E297,2)","v":0},{"$f":"Wniosek!D297","v":0},{"$f":"Wniosek!F297","v":0},{"$f":"Wniosek!G297","v":0},{"$f":"Wniosek!H297","v":0},{"$f":"Wniosek!I297","v":0},null,null,9,0,0,0,0,0,0,0,0,0,0,0,"ok","ok",0,0,{"$f":"Wniosek!F43","v":"00:00:00"},{"$f":"Wniosek!G43","v":"00:00:00"},{"$f":"Wniosek!H43","v":""}]
[{"$f":"Wniosek!A177","v":10},{"$f":"Wniosek!B298","v":""},{"$f":"Wniosek!C298","v":0},{"$f":"ROUND(Wniosek!E298,2)","v":0},{"$f":"Wniosek!D298","v":0},{"$f":"Wniosek!F298","v":0},{"$f":"Wniosek!G298","v":0},{"$f":"Wniosek!H298","v":0},{"$f":"Wniosek!I298","v":0},null,null,10,0,0,0,0,0,0,0,0,0,0,0,"ok","ok",0,0,{"$f":"Wniosek!F44","v":"00:00:00"},{"$f":"Wniosek!G44","v":"00:00:00"},{"$f":"Wniosek!H44","v":""}]
[{"$f":"Wniosek!A178","v":11},{"$f":"Wniosek!B299","v":""},{"$f":"Wniosek!C299","v":0},{"$f":"ROUND(Wniosek!E299,2)","v":0},{"$f":"Wniosek!D299","v":0},{"$f":"Wniosek!F299","v":0},{"$f":"Wniosek!G299","v":0},{"$f":"Wniosek!H299","v":0},{"$f":"Wniosek!I299","v":0},null,null,11,0,0,0,0,0,0,0,0,0,0,0,"ok","ok",0,0,{"$f":"Wniosek!F45","v":"00:00:00"},{"$f":"Wniosek!G45","v":"00:00:00"},{"$f":"Wniosek!H45","v":""}]
[{"$f":"Wniosek!A179","v":12},{"$f":"Wniosek!B300","v":""},{"$f":"Wniosek!C300","v":0},{"$f":"ROUND(Wniosek!E300,2)","v":0},{"$f":"Wniosek!D300","v":0},{"$f":"Wniosek!F300","v":0},{"$f":"Wniosek!G300","v":0},{"$f":"Wniosek!H300","v":0},{"$f":"Wniosek!I300","v":0},null,null,12,0,0,0,0,0,0,0,0,0,0,0,"ok","ok",0,0,{"$f":"Wniosek!F46","v":"00:00:00"},{"$f":"Wniosek!G46","v":"00:00:00"},{"$f":"Wniosek!H46","v":""}]
[{"$f":"Wniosek!A180","v":13},{"$f":"Wniosek!B301","v":""},{"$f":"Wniosek!C301","v":0},{"$f":"ROUND(Wniosek!E301,2)","v":0},{"$f":"Wniosek!D301","v":0},{"$f":"Wniosek!F301","v":0},{"$f":"Wniosek!G301","v":0},{"$f":"Wniosek!H301","v":0},{"$f":"Wniosek!I301","v":0},null,null,13,0,0,0,0,0,0,0,0,0,0,0,"ok","ok",0,0,{"$f":"Wniosek!F47","v":"00:00:00"},{"$f":"Wniosek!G47","v":"00:00:00"},{"$f":"Wniosek!H47","v":""}]
[{"$f":"Wniosek!A181","v":14},{"$f":"Wniosek!B302","v":""},{"$f":"Wniosek!C302","v":0},{"$f":"ROUND(Wniosek!E302,2)","v":0},{"$f":"Wniosek!D302","v":0},{"$f":"Wniosek!F302","v":0},{"$f":"Wniosek!G302","v":0},{"$f":"Wniosek!H302","v":0},{"$f":"Wniosek!I302","v":0},null,null,14,0,0,0,0,0,0,0,0,0,0,0,"ok","ok",0,0,{"$f":"Wniosek!F48","v":"00:00:00"},{"$f":"Wniosek!G48","v":"00:00:00"},{"$f":"Wniosek!H48","v":""}]
[{"$f":"Wniosek!A182","v":15},{"$f":"Wniosek!B303","v":""},{"$f":"Wniosek!C303","v":0},{"$f":"ROUND(Wniosek!E303,2)","v":0},{"$f":"Wniosek!D303","v":0},{"$f":"Wniosek!F303","v":0},{"$f":"Wniosek!G303","v":0},{"$f":"Wniosek!H303","v":0},{"$f":"Wniosek!I303","v":0},null,null,15,0,0,0,0,0,0,0,0,0,0,0,"ok","ok",0,0,{"$f":"Wniosek!F49","v":"00:00:00"},{"$f":"Wniosek!G49","v":"00:00:00"},{"$f":"Wniosek!H49","v":""}]
[{"$f":"Wniosek!A183","v":16},{"$f":"Wniosek!B304","v":""},{"$f":"Wniosek!C304","v":0},{"$f":"ROUND(Wniosek!E304,2)","v":0},{"$f":"Wniosek!D304","v":0},{"$f":"Wniosek!F304","v":0},{"$f":"Wniosek!G304","v":0},{"$f":"Wniosek!H304","v":0},{"$f":"Wniosek!I304","v":0},null,null,16,0,0,0,0,0,0,0,0,0,0,0,"ok","ok",0,0,{"$f":"Wniosek!F50","v":"00:00:00"},{"$f":"Wniosek!G50","v":"00:00:00"},{"$f":"Wniosek!H50","v":""}]
[{"$f":"Wniosek!A184","v":17},{"$f":"Wniosek!B305","v":""},{"$f":"Wniosek!C305","v":0},{"$f":"ROUND(Wniosek!E305,2)","v":0},{"$f":"Wniosek!D305","v":0},{"$f":"Wniosek!F305","v":0},{"$f":"Wniosek!G305","v":0},{"$f":"Wniosek!H305","v":0},{"$f":"Wniosek!I305","v":0},null,null,17,0,0,0,0,0,0,0,0,0,0,0,"ok","ok",0,0,{"$f":"Wniosek!F51","v":"00:00:00"},{"$f":"Wniosek!G51","v":"00:00:00"},{"$f":"Wniosek!H51","v":""}]
[{"$f":"Wniosek!A185","v":18},{"$f":"Wniosek!B306","v":""},{"$f":"Wniosek!C306","v":0},{"$f":"ROUND(Wniosek!E306,2)","v":0},{"$f":"Wniosek!D306","v":0},{"$f":"Wniosek!F306","v":0},{"$f":"Wniosek!G306","v":0},{"$f":"Wniosek!H306","v":0},{"$f":"Wniosek!I306","v":0},null,null,18,0,0,0,0,0,0,0,0,0,0,0,"ok","ok",0,0,{"$f":"Wniosek!F52","v":"00:00:00"},{"$f":"Wniosek!G52","v":"00:00:00"},{"$f":"Wniosek!H52","v":""}]
[{"$f":"Wniosek!A186","v":19},{"$f":"Wniosek!B307","v":""},{"$f":"Wniosek!C307","v":0},{"$f":"ROUND(Wniosek!E307,2)","v":0},{"$f":"Wniosek!D307","v":0},{"$f":"Wniosek!F307","v":0},{"$f":"Wniosek!G307","v":0},{"$f":"Wniosek!H307","v":0},{"$f":"Wniosek!I307","v":0},null,null,19,0,0,0,0,0,0,0,0,0,0,0,"ok","ok",0,0,{"$f":"Wniosek!F53","v":"00:00:00"},{"$f":"Wniosek!G53","v":"00:00:00"},{"$f":"Wniosek!H53","v":""}]
[{"$f":"Wniosek!A187","v":20},{"$f":"Wniosek!B308","v":""},{"$f":"Wniosek!C308","v":0},{"$f":"ROUND(Wniosek!E308,2)","v":0},{"$f":"Wniosek!D308","v":0},{"$f":"Wniosek!F308","v":0},{"$f":"Wniosek!G308","v":0},{"$f":"Wniosek!H308","v":0},{"$f":"Wniosek!I308","v":0},null,null,20,0,0,0,0,0,0,0,0,0,0,0,"ok","ok",0,0,{"$f":"Wniosek!F54","v":"00:00:00"},{"$f":"Wniosek!G54","v":"00:00:00"},{"$f":"Wniosek!H54","v":""}]
[{"$f":"Wniosek!A188","v":21},{"$f":"Wniosek!B309","v":""},{"$f":"Wniosek!C309","v":0},{"$f":"ROUND(Wniosek!E309,2)","v":0},{"$f":"Wniosek!D309","v":0},{"$f":"Wniosek!F309","v":0},{"$f":"Wniosek!G309","v":0},{"$f":"Wniosek!H309","v":0},{"$f":"Wniosek!I309","v":0},null,null,21,0,0,0,0,0,0,0,0,0,0,0,"ok","ok",0,0,{"$f":"Wniosek!F55","v":"00:00:00"},{"$f":"Wniosek!G55","v":"00:00:00"},{"$f":"Wniosek!H55","v":""}]
[{"$f":"Wniosek!A189","v":22},{"$f":"Wniosek!B310","v":""},{"$f":"Wniosek!C310","v":0},{"$f":"ROUND(Wniosek!E310,2)","v":0},{"$f":"Wniosek!D310","v":0},{"$f":"Wniosek!F310","v":0},{"$f":"Wniosek!G310","v":0},{"$f":"Wniosek!H310","v":0},{"$f":"Wniosek!I310","v":0},null,null,22,0,0,0,0,0,0,0,0,0,0,0,"ok","ok",0,0,{"$f":"Wniosek!F56","v":"00:00:00"},{"$f":"Wniosek!G56","v":"00:00:00"},{"$f":"Wniosek!H56","v":""}]
[{"$f":"Wniosek!A190","v":23},{"$f":"Wniosek!B311","v":""},{"$f":"Wniosek!C311","v":0},{"$f":"ROUND(Wniosek!E311,2)","v":0},{"$f":"Wniosek!D311","v":0},{"$f":"Wniosek!F311","v":0},{"$f":"Wniosek!G311","v":0},{"$f":"Wniosek!H311","v":0},{"$f":"Wniosek!I311","v":0},null,null,23,0,0,0,0,0,0,0,0,0,0,0,"ok","ok",0,0,{"$f":"Wniosek!F57","v":"00:00:00"},{"$f":"Wniosek!G57","v":"00:00:00"},{"$f":"Wniosek!H57","v":""}]
[{"$f":"Wniosek!A191","v":24},{"$f":"Wniosek!B312","v":""},{"$f":"Wniosek!C312","v":0},{"$f":"ROUND(Wniosek!E312,2)","v":0},{"$f":"Wniosek!D312","v":0},{"$f":"Wniosek!F312","v":0},{"$f":"Wniosek!G312","v":0},{"$f":"Wniosek!H312","v":0},{"$f":"Wniosek!I312","v":0},null,null,24,0,0,0,0,0,0,0,0,0,0,0,"ok","ok",0,0,{"$f":"Wniosek!F58","v":"00:00:00"},{"$f":"Wniosek!G58","v":"00:00:00"},{"$f":"Wniosek!H58","v":""}]
[{"$f":"Wniosek!A192","v":25},{"$f":"Wniosek!B313","v":""},{"$f":"Wniosek!C313","v":0},{"$f":"ROUND(Wniosek!E313,2)","v":0},{"$f":"Wniosek!D313","v":0},{"$f":"Wniosek!F313","v":0},{"$f":"Wniosek!G313","v":0},{"$f":"Wniosek!H313","v":0},{"$f":"Wniosek!I313","v":0},null,null,25,0,0,0,0,0,0,0,0,0,0,0,"ok","ok",0,0,{"$f":"Wniosek!F59","v":"00:00:00"},{"$f":"Wniosek!G59","v":"00:00:00"},{"$f":"Wniosek!H59","v":""}]
[{"$f":"Wniosek!A193","v":26},{"$f":"Wniosek!B314","v":""},{"$f":"Wniosek!C314","v":0},{"$f":"ROUND(Wniosek!E314,2)","v":0},{"$f":"Wniosek!D314","v":0},{"$f":"Wniosek!F314","v":0},{"$f":"Wniosek!G314","v":0},{"$f":"Wniosek!H314","v":0},{"$f":"Wniosek!I314","v":0},null,null,26,0,0,0,0,0,0,0,0,0,0,0,"ok","ok",0,0,{"$f":"Wniosek!F60","v":"00:00:00"},{"$f":"Wniosek!G60","v":"00:00:00"},{"$f":"Wniosek!H60","v":""}]
[{"$f":"Wniosek!A194","v":27},{"$f":"Wniosek!B315","v":""},{"$f":"Wniosek!C315","v":0},{"$f":"ROUND(Wniosek!E315,2)","v":0},{"$f":"Wniosek!D315","v":0},{"$f":"Wniosek!F315","v":0},{"$f":"Wniosek!G315","v":0},{"$f":"Wniosek!H315","v":0},{"$f":"Wniosek!I315","v":0},null,null,27,0,0,0,0,0,0,0,0,0,0,0,"ok","ok",0,0,{"$f":"Wniosek!F61","v":"00:00:00"},{"$f":"Wniosek!G61","v":"00:00:00"},{"$f":"Wniosek!H61","v":""}]
[{"$f":"Wniosek!A195","v":28},{"$f":"Wniosek!B316","v":""},{"$f":"Wniosek!C316","v":0},{"$f":"ROUND(Wniosek!E316,2)","v":0},{"$f":"Wniosek!D316","v":0},{"$f":"Wniosek!F316","v":0},{"$f":"Wniosek!G316","v":0},{"$f":"Wniosek!H316","v":0},{"$f":"Wniosek!I316","v":0},null,null,28,0,0,0,0,0,0,0,0,0,0,0,"ok","ok",0,0,{"$f":"Wniosek!F62","v":"00:00:00"},{"$f":"Wniosek!G62","v":"00:00:00"},{"$f":"Wniosek!H62","v":""}]
[{"$f":"Wniosek!A196","v":29},{"$f":"Wniosek!B317","v":""},{"$f":"Wniosek!C317","v":0},{"$f":"ROUND(Wniosek!E317,2)","v":0},{"$f":"Wniosek!D317","v":0},{"$f":"Wniosek!F317","v":0},{"$f":"Wniosek!G317","v":0},{"$f":"Wniosek!H317","v":0},{"$f":"Wniosek!I317","v":0},null,null,29,0,0,0,0,0,0,0,0,0,0,0,"ok","ok",0,0,{"$f":"Wniosek!F63","v":"00:00:00"},{"$f":"Wniosek!G63","v":"00:00:00"},{"$f":"Wniosek!H63","v":""}]
[{"$f":"Wniosek!A197","v":30},{"$f":"Wniosek!B318","v":""},{"$f":"Wniosek!C318","v":0},{"$f":"ROUND(Wniosek!E318,2)","v":0},{"$f":"Wniosek!D318","v":0},{"$f":"Wniosek!F318","v":0},{"$f":"Wniosek!G318","v":0},{"$f":"Wniosek!H318","v":0},{"$f":"Wniosek!I318","v":0},null,null,30,0,0,0,0,0,0,0,0,0,0,0,"ok","ok",0,0,{"$f":"Wniosek!F64","v":"00:00:00"},{"$f":"Wniosek!G64","v":"00:00:00"},{"$f":"Wniosek!H64","v":""}]
[{"$f":"Wniosek!A198","v":31},{"$f":"Wniosek!B319","v":""},{"$f":"Wniosek!C319","v":0},{"$f":"ROUND(Wniosek!E319,2)","v":0},{"$f":"Wniosek!D319","v":0},{"$f":"Wniosek!F319","v":0},{"$f":"Wniosek!G319","v":0},{"$f":"Wniosek!H319","v":0},{"$f":"Wniosek!I319","v":0},null,null,31,0,0,0,0,0,0,0,0,0,0,0,"ok","ok",0,0,{"$f":"Wniosek!F65","v":"00:00:00"},{"$f":"Wniosek!G65","v":"00:00:00"},{"$f":"Wniosek!H65","v":""}]
[{"$f":"Wniosek!A199","v":32},{"$f":"Wniosek!B320","v":""},{"$f":"Wniosek!C320","v":0},{"$f":"ROUND(Wniosek!E320,2)","v":0},{"$f":"Wniosek!D320","v":0},{"$f":"Wniosek!F320","v":0},{"$f":"Wniosek!G320","v":0},{"$f":"Wniosek!H320","v":0},{"$f":"Wniosek!I320","v":0},null,null,32,0,0,0,0,0,0,0,0,0,0,0,"ok","ok",0,0,{"$f":"Wniosek!F66","v":"00:00:00"},{"$f":"Wniosek!G66","v":"00:00:00"},{"$f":"Wniosek!H66","v":""}]
[{"$f":"Wniosek!A200","v":33},{"$f":"Wniosek!B321","v":""},{"$f":"Wniosek!C321","v":0},{"$f":"ROUND(Wniosek!E321,2)","v":0},{"$f":"Wniosek!D321","v":0},{"$f":"Wniosek!F321","v":0},{"$f":"Wniosek!G321","v":0},{"$f":"Wniosek!H321","v":0},{"$f":"Wniosek!I321","v":0},null,null,33,0,0,0,0,0,0,0,0,0,0,0,"ok","ok",0,0,{"$f":"Wniosek!F67","v":"00:00:00"},{"$f":"Wniosek!G67","v":"00:00:00"},{"$f":"Wniosek!H67","v":""}]
[{"$f":"Wniosek!A201","v":34},{"$f":"Wniosek!B322","v":""},{"$f":"Wniosek!C322","v":0},{"$f":"ROUND(Wniosek!E322,2)","v":0},{"$f":"Wniosek!D322","v":0},{"$f":"Wniosek!F322","v":0},{"$f":"Wniosek!G322","v":0},{"$f":"Wniosek!H322","v":0},{"$f":"Wniosek!I322","v":0},null,null,34,0,0,0,0,0,0,0,0,0,0,0,"ok","ok",0,0,{"$f":"Wniosek!F68","v":"00:00:00"},{"$f":"Wniosek!G68","v":"00:00:00"},{"$f":"Wniosek!H68","v":""}]
[{"$f":"Wniosek!A202","v":35},{"$f":"Wniosek!B323","v":""},{"$f":"Wniosek!C323","v":0},{"$f":"ROUND(Wniosek!E323,2)","v":0},{"$f":"Wniosek!D323","v":0},{"$f":"Wniosek!F323","v":0},{"$f":"Wniosek!G323","v":0},{"$f":"Wniosek!H323","v":0},{"$f":"Wniosek!I323","v":0},null,null,35,0,0,0,0,0,0,0,0,0,0,0,"ok","ok",0,0,{"$f":"Wniosek!F69","v":"00:00:00"},{"$f":"Wniosek!G69","v":"00:00:00"},{"$f":"Wniosek!H69","v":""}]
[{"$f":"Wniosek!A203","v":36},{"$f":"Wniosek!B324","v":""},{"$f":"Wniosek!C324","v":0},{"$f":"ROUND(Wniosek!E324,2)","v":0},{"$f":"Wniosek!D324","v":0},{"$f":"Wniosek!F324","v":0},{"$f":"Wniosek!G324","v":0},{"$f":"Wniosek!H324","v":0},{"$f":"Wniosek!I324","v":0},null,null,36,0,0,0,0,0,0,0,0,0,0,0,"ok","ok",0,0,{"$f":"Wniosek!F70","v":"00:00:00"},{"$f":"Wniosek!G70","v":"00:00:00"},{"$f":"Wniosek!H70","v":""}]
[{"$f":"Wniosek!A204","v":37},{"$f":"Wniosek!B325","v":""},{"$f":"Wniosek!C325","v":0},{"$f":"ROUND(Wniosek!E325,2)","v":0},{"$f":"Wniosek!D325","v":0},{"$f":"Wniosek!F325","v":0},{"$f":"Wniosek!G325","v":0},{"$f":"Wniosek!H325","v":0},{"$f":"Wniosek!I325","v":0},null,null,37,0,0,0,0,0,0,0,0,0,0,0,"ok","ok",0,0,{"$f":"Wniosek!F71","v":"00:00:00"},{"$f":"Wniosek!G71","v":"00:00:00"},{"$f":"Wniosek!H71","v":""}]
[{"$f":"Wniosek!A205","v":38},{"$f":"Wniosek!B326","v":""},{"$f":"Wniosek!C326","v":0},{"$f":"ROUND(Wniosek!E326,2)","v":0},{"$f":"Wniosek!D326","v":0},{"$f":"Wniosek!F326","v":0},{"$f":"Wniosek!G326","v":0},{"$f":"Wniosek!H326","v":0},{"$f":"Wniosek!I326","v":0},null,null,38,0,0,0,0,0,0,0,0,0,0,0,"ok","ok",0,0,{"$f":"Wniosek!F72","v":"00:00:00"},{"$f":"Wniosek!G72","v":"00:00:00"},{"$f":"Wniosek!H72","v":""}]
[{"$f":"Wniosek!A206","v":39},{"$f":"Wniosek!B327","v":""},{"$f":"Wniosek!C327","v":0},{"$f":"ROUND(Wniosek!E327,2)","v":0},{"$f":"Wniosek!D327","v":0},{"$f":"Wniosek!F327","v":0},{"$f":"Wniosek!G327","v":0},{"$f":"Wniosek!H327","v":0},{"$f":"Wniosek!I327","v":0},null,null,39,0,0,0,0,0,0,0,0,0,0,0,"ok","ok",0,0,{"$f":"Wniosek!F73","v":"00:00:00"},{"$f":"Wniosek!G73","v":"00:00:00"},{"$f":"Wniosek!H73","v":""}]
[{"$f":"Wniosek!A207","v":40},{"$f":"Wniosek!B328","v":""},{"$f":"Wniosek!C328","v":0},{"$f":"ROUND(Wniosek!E328,2)","v":0},{"$f":"Wniosek!D328","v":0},{"$f":"Wniosek!F328","v":0},{"$f":"Wniosek!G328","v":0},{"$f":"Wniosek!H328","v":0},{"$f":"Wniosek!I328","v":0},null,null,40,0,0,0,0,0,0,0,0,0,0,0,"ok","ok",0,0,{"$f":"Wniosek!F74","v":"00:00:00"},{"$f":"Wniosek!G74","v":"00:00:00"},{"$f":"Wniosek!H74","v":""}]
[{"$f":"Wniosek!A208","v":41},{"$f":"Wniosek!B329","v":""},{"$f":"Wniosek!C329","v":0},{"$f":"ROUND(Wniosek!E329,2)","v":0},{"$f":"Wniosek!D329","v":0},{"$f":"Wniosek!F329","v":0},{"$f":"Wniosek!G329","v":0},{"$f":"Wniosek!H329","v":0},{"$f":"Wniosek!I329","v":0},null,null,41,0,0,0,0,0,0,0,0,0,0,0,"ok","ok",0,0,{"$f":"Wniosek!F75","v":"00:00:00"},{"$f":"Wniosek!G75","v":"00:00:00"},{"$f":"Wniosek!H75","v":""}]
[{"$f":"Wniosek!A209","v":42},{"$f":"Wniosek!B330","v":""},{"$f":"Wniosek!C330","v":0},{"$f":"ROUND(Wniosek!E330,2)","v":0},{"$f":"Wniosek!D330","v":0},{"$f":"Wniosek!F330","v":0},{"$f":"Wniosek!G330","v":0},{"$f":"Wniosek!H330","v":0},{"$f":"Wniosek!I330","v":0},null,null,42,0,0,0,0,0,0,0,0,0,0,0,"ok","ok",0,0,{"$f":"Wniosek!F76","v":"00:00:00"},{"$f":"Wniosek!G76","v":"00:00:00"},{"$f":"Wniosek!H76","v":""}]
[{"$f":"Wniosek!A210","v":43},{"$f":"Wniosek!B331","v":""},{"$f":"Wniosek!C331","v":0},{"$f":"ROUND(Wniosek!E331,2)","v":0},{"$f":"Wniosek!D331","v":0},{"$f":"Wniosek!F331","v":0},{"$f":"Wniosek!G331","v":0},{"$f":"Wniosek!H331","v":0},{"$f":"Wniosek!I331","v":0},null,null,43,0,0,0,0,0,0,0,0,0,0,0,"ok","ok",0,0,{"$f":"Wniosek!F77","v":"00:00:00"},{"$f":"Wniosek!G77","v":"00:00:00"},{"$f":"Wniosek!H77","v":""}]
[{"$f":"Wniosek!A211","v":44},{"$f":"Wniosek!B332","v":""},{"$f":"Wniosek!C332","v":0},{"$f":"ROUND(Wniosek!E332,2)","v":0},{"$f":"Wniosek!D332","v":0},{"$f":"Wniosek!F332","v":0},{"$f":"Wniosek!G332","v":0},{"$f":"Wniosek!H332","v":0},{"$f":"Wniosek!I332","v":0},null,null,44,0,0,0,0,0,0,0,0,0,0,0,"ok","ok",0,0,{"$f":"Wniosek!F78","v":"00:00:00"},{"$f":"Wniosek!G78","v":"00:00:00"},{"$f":"Wniosek!H78","v":""}]
[{"$f":"Wniosek!A212","v":45},{"$f":"Wniosek!B333","v":""},{"$f":"Wniosek!C333","v":0},{"$f":"ROUND(Wniosek!E333,2)","v":0},{"$f":"Wniosek!D333","v":0},{"$f":"Wniosek!F333","v":0},{"$f":"Wniosek!G333","v":0},{"$f":"Wniosek!H333","v":0},{"$f":"Wniosek!I333","v":0},null,null,45,0,0,0,0,0,0,0,0,0,0,0,"ok","ok",0,0,{"$f":"Wniosek!F79","v":"00:00:00"},{"$f":"Wniosek!G79","v":"00:00:00"},{"$f":"Wniosek!H79","v":""}]
[{"$f":"Wniosek!A213","v":46},{"$f":"Wniosek!B334","v":""},{"$f":"Wniosek!C334","v":0},{"$f":"ROUND(Wniosek!E334,2)","v":0},{"$f":"Wniosek!D334","v":0},{"$f":"Wniosek!F334","v":0},{"$f":"Wniosek!G334","v":0},{"$f":"Wniosek!H334","v":0},{"$f":"Wniosek!I334","v":0},null,null,46,0,0,0,0,0,0,0,0,0,0,0,"ok","ok",0,0,{"$f":"Wniosek!F80","v":"00:00:00"},{"$f":"Wniosek!G80","v":"00:00:00"},{"$f":"Wniosek!H80","v":""}]
[{"$f":"Wniosek!A214","v":47},{"$f":"Wniosek!B335","v":""},{"$f":"Wniosek!C335","v":0},{"$f":"ROUND(Wniosek!E335,2)","v":0},{"$f":"Wniosek!D335","v":0},{"$f":"Wniosek!F335","v":0},{"$f":"Wniosek!G335","v":0},{"$f":"Wniosek!H335","v":0},{"$f":"Wniosek!I335","v":0},null,null,47,0,0,0,0,0,0,0,0,0,0,0,"ok","ok",0,0,{"$f":"Wniosek!F81","v":"00:00:00"},{"$f":"Wniosek!G81","v":"00:00:00"},{"$f":"Wniosek!H81","v":""}]
[{"$f":"Wniosek!A215","v":48},{"$f":"Wniosek!B336","v":""},{"$f":"Wniosek!C336","v":0},{"$f":"ROUND(Wniosek!E336,2)","v":0},{"$f":"Wniosek!D336","v":0},{"$f":"Wniosek!F336","v":0},{"$f":"Wniosek!G336","v":0},{"$f":"Wniosek!H336","v":0},{"$f":"Wniosek!I336","v":0},null,null,48,0,0,0,0,0,0,0,0,0,0,0,"ok","ok",0,0,{"$f":"Wniosek!F82","v":"00:00:00"},{"$f":"Wniosek!G82","v":"00:00:00"},{"$f":"Wniosek!H82","v":""}]
[{"$f":"Wniosek!A216","v":49},{"$f":"Wniosek!B337","v":""},{"$f":"Wniosek!C337","v":0},{"$f":"ROUND(Wniosek!E337,2)","v":0},{"$f":"Wniosek!D337","v":0},{"$f":"Wniosek!F337","v":0},{"$f":"Wniosek!G337","v":0},{"$f":"Wniosek!H337","v":0},{"$f":"Wniosek!I337","v":0},null,null,49,0,0,0,0,0,0,0,0,0,0,0,"ok","ok",0,0,{"$f":"Wniosek!F83","v":"00:00:00"},{"$f":"Wniosek!G83","v":"00:00:00"},{"$f":"Wniosek!H83","v":""}]
[{"$f":"Wniosek!A217","v":50},{"$f":"Wniosek!B338","v":""},{"$f":"Wniosek!C338","v":0},{"$f":"ROUND(Wniosek!E338,2)","v":0},{"$f":"Wniosek!D338","v":0},{"$f":"Wniosek!F338","v":0},{"$f":"Wniosek!G338","v":0},{"$f":"Wniosek!H338","v":0},{"$f":"Wniosek!I338","v":0},null,null,50,0,0,0,0,0,0,0,0,0,0,0,"ok","ok",0,0,{"$f":"Wniosek!F84","v":"00:00:00"},{"$f":"Wniosek!G84","v":"00:00:00"},{"$f":"Wniosek!H84","v":""}]
[{"$f":"Wniosek!A218","v":51},{"$f":"Wniosek!B339","v":""},{"$f":"Wniosek!C339","v":0},{"$f":"ROUND(Wniosek!E339,2)","v":0},{"$f":"Wniosek!D339","v":0},{"$f":"Wniosek!F339","v":0},{"$f":"Wniosek!G339","v":0},{"$f":"Wniosek!H339","v":0},{"$f":"Wniosek!I339","v":0},null,null,51,0,0,0,0,0,0,0,0,0,0,0,"ok","ok",0,0,{"$f":"Wniosek!F85","v":"00:00:00"},{"$f":"Wniosek!G85","v":"00:00:00"},{"$f":"Wniosek!H85","v":""}]
[{"$f":"Wniosek!A219","v":52},{"$f":"Wniosek!B340","v":""},{"$f":"Wniosek!C340","v":0},{"$f":"ROUND(Wniosek!E340,2)","v":0},{"$f":"Wniosek!D340","v":0},{"$f":"Wniosek!F340","v":0},{"$f":"Wniosek!G340","v":0},{"$f":"Wniosek!H340","v":0},{"$f":"Wniosek!I340","v":0},null,null,52,0,0,0,0,0,0,0,0,0,0,0,"ok","ok",0,0,{"$f":"Wniosek!F86","v":"00:00:00"},{"$f":"Wniosek!G86","v":"00:00:00"},{"$f":"Wniosek!H86","v":""}]
[{"$f":"Wniosek!A220","v":53},{"$f":"Wniosek!B341","v":""},{"$f":"Wniosek!C341","v":0},{"$f":"ROUND(Wniosek!E341,2)","v":0},{"$f":"Wniosek!D341","v":0},{"$f":"Wniosek!F341","v":0},{"$f":"Wniosek!G341","v":0},{"$f":"Wniosek!H341","v":0},{"$f":"Wniosek!I341","v":0},null,null,53,0,0,0,0,0,0,0,0,0,0,0,"ok","ok",0,0,{"$f":"Wniosek!F87","v":"00:00:00"},{"$f":"Wniosek!G87","v":"00:00:00"},{"$f":"Wniosek!H87","v":""}]
[{"$f":"Wniosek!A221","v":54},{"$f":"Wniosek!B342","v":""},{"$f":"Wniosek!C342","v":0},{"$f":"ROUND(Wniosek!E342,2)","v":0},{"$f":"Wniosek!D342","v":0},{"$f":"Wniosek!F342","v":0},{"$f":"Wniosek!G342","v":0},{"$f":"Wniosek!H342","v":0},{"$f":"Wniosek!I342","v":0},null,null,54,0,0,0,0,0,0,0,0,0,0,0,"ok","ok",0,0,{"$f":"Wniosek!F88","v":"00:00:00"},{"$f":"Wniosek!G88","v":"00:00:00"},{"$f":"Wniosek!H88","v":""}]
[{"$f":"Wniosek!A222","v":55},{"$f":"Wniosek!B343","v":""},{"$f":"Wniosek!C343","v":0},{"$f":"ROUND(Wniosek!E343,2)","v":0},{"$f":"Wniosek!D343","v":0},{"$f":"Wniosek!F343","v":0},{"$f":"Wniosek!G343","v":0},{"$f":"Wniosek!H343","v":0},{"$f":"Wniosek!I343","v":0},null,null,55,0,0,0,0,0,0,0,0,0,0,0,"ok","ok",0,0,{"$f":"Wniosek!F89","v":"00:00:00"},{"$f":"Wniosek!G89","v":"00:00:00"},{"$f":"Wniosek!H89","v":""}]
[{"$f":"Wniosek!A223","v":56},{"$f":"Wniosek!B344","v":""},{"$f":"Wniosek!C344","v":0},{"$f":"ROUND(Wniosek!E344,2)","v":0},{"$f":"Wniosek!D344","v":0},{"$f":"Wniosek!F344","v":0},{"$f":"Wniosek!G344","v":0},{"$f":"Wniosek!H344","v":0},{"$f":"Wniosek!I344","v":0},null,null,56,0,0,0,0,0,0,0,0,0,0,0,"ok","ok",0,0,{"$f":"Wniosek!F90","v":"00:00:00"},{"$f":"Wniosek!G90","v":"00:00:00"},{"$f":"Wniosek!H90","v":""}]
[{"$f":"Wniosek!A224","v":57},{"$f":"Wniosek!B345","v":""},{"$f":"Wniosek!C345","v":0},{"$f":"ROUND(Wniosek!E345,2)","v":0},{"$f":"Wniosek!D345","v":0},{"$f":"Wniosek!F345","v":0},{"$f":"Wniosek!G345","v":0},{"$f":"Wniosek!H345","v":0},{"$f":"Wniosek!I345","v":0},null,null,57,0,0,0,0,0,0,0,0,0,0,0,"ok","ok",0,0,{"$f":"Wniosek!F91","v":"00:00:00"},{"$f":"Wniosek!G91","v":"00:00:00"},{"$f":"Wniosek!H91","v":""}]
[{"$f":"Wniosek!A225","v":58},{"$f":"Wniosek!B346","v":""},{"$f":"Wniosek!C346","v":0},{"$f":"ROUND(Wniosek!E346,2)","v":0},{"$f":"Wniosek!D346","v":0},{"$f":"Wniosek!F346","v":0},{"$f":"Wniosek!G346","v":0},{"$f":"Wniosek!H346","v":0},{"$f":"Wniosek!I346","v":0},null,null,58,0,0,0,0,0,0,0,0,0,0,0,"ok","ok",0,0,{"$f":"Wniosek!F92","v":"00:00:00"},{"$f":"Wniosek!G92","v":"00:00:00"},{"$f":"Wniosek!H92","v":""}]
[{"$f":"Wniosek!A226","v":59},{"$f":"Wniosek!B347","v":""},{"$f":"Wniosek!C347","v":0},{"$f":"ROUND(Wniosek!E347,2)","v":0},{"$f":"Wniosek!D347","v":0},{"$f":"Wniosek!F347","v":0},{"$f":"Wniosek!G347","v":0},{"$f":"Wniosek!H347","v":0},{"$f":"Wniosek!I347","v":0},null,null,59,0,0,0,0,0,0,0,0,0,0,0,"ok","ok",0,0,{"$f":"Wniosek!F93","v":"00:00:00"},{"$f":"Wniosek!G93","v":"00:00:00"},{"$f":"Wniosek!H93","v":""}]
[{"$f":"Wniosek!A227","v":60},{"$f":"Wniosek!B348","v":""},{"$f":"Wniosek!C348","v":0},{"$f":"ROUND(Wniosek!E348,2)","v":0},{"$f":"Wniosek!D348","v":0},{"$f":"Wniosek!F348","v":0},{"$f":"Wniosek!G348","v":0},{"$f":"Wniosek!H348","v":0},{"$f":"Wniosek!I348","v":0},null,null,60,0,0,0,0,0,0,0,0,0,0,0,"ok","ok",0,0,{"$f":"Wniosek!F94","v":"00:00:00"},{"$f":"Wniosek!G94","v":"00:00:00"},{"$f":"Wniosek!H94","v":""}]
[{"$f":"Wniosek!A228","v":61},{"$f":"Wniosek!B349","v":""},{"$f":"Wniosek!C349","v":0},{"$f":"ROUND(Wniosek!E349,2)","v":0},{"$f":"Wniosek!D349","v":0},{"$f":"Wniosek!F349","v":0},{"$f":"Wniosek!G349","v":0},{"$f":"Wniosek!H349","v":0},{"$f":"Wniosek!I349","v":0},null,null,61,0,0,0,0,0,0,0,0,0,0,0,"ok","ok",0,0,{"$f":"Wniosek!F95","v":"00:00:00"},{"$f":"Wniosek!G95","v":"00:00:00"},{"$f":"Wniosek!H95","v":""}]
[{"$f":"Wniosek!A229","v":62},{"$f":"Wniosek!B350","v":""},{"$f":"Wniosek!C350","v":0},{"$f":"ROUND(Wniosek!E350,2)","v":0},{"$f":"Wniosek!D350","v":0},{"$f":"Wniosek!F350","v":0},{"$f":"Wniosek!G350","v":0},{"$f":"Wniosek!H350","v":0},{"$f":"Wniosek!I350","v":0},null,null,62,0,0,0,0,0,0,0,0,0,0,0,"ok","ok",0,0,{"$f":"Wniosek!F96","v":"00:00:00"},{"$f":"Wniosek!G96","v":"00:00:00"},{"$f":"Wniosek!H96","v":""}]
[{"$f":"Wniosek!A230","v":63},{"$f":"Wniosek!B351","v":""},{"$f":"Wniosek!C351","v":0},{"$f":"ROUND(Wniosek!E351,2)","v":0},{"$f":"Wniosek!D351","v":0},{"$f":"Wniosek!F351","v":0},{"$f":"Wniosek!G351","v":0},{"$f":"Wniosek!H351","v":0},{"$f":"Wniosek!I351","v":0},null,null,63,0,0,0,0,0,0,0,0,0,0,0,"ok","ok",0,0,{"$f":"Wniosek!F97","v":"00:00:00"},{"$f":"Wniosek!G97","v":"00:00:00"},{"$f":"Wniosek!H97","v":""}]
[{"$f":"Wniosek!A231","v":64},{"$f":"Wniosek!B352","v":""},{"$f":"Wniosek!C352","v":0},{"$f":"ROUND(Wniosek!E352,2)","v":0},{"$f":"Wniosek!D352","v":0},{"$f":"Wniosek!F352","v":0},{"$f":"Wniosek!G352","v":0},{"$f":"Wniosek!H352","v":0},{"$f":"Wniosek!I352","v":0},null,null,64,0,0,0,0,0,0,0,0,0,0,0,"ok","ok",0,0,{"$f":"Wniosek!F98","v":"00:00:00"},{"$f":"Wniosek!G98","v":"00:00:00"},{"$f":"Wniosek!H98","v":""}]
[{"$f":"Wniosek!A232","v":65},{"$f":"Wniosek!B353","v":""},{"$f":"Wniosek!C353","v":0},{"$f":"ROUND(Wniosek!E353,2)","v":0},{"$f":"Wniosek!D353","v":0},{"$f":"Wniosek!F353","v":0},{"$f":"Wniosek!G353","v":0},{"$f":"Wniosek!H353","v":0},{"$f":"Wniosek!I353","v":0},null,null,65,0,0,0,0,0,0,0,0,0,0,0,"ok","ok",0,0,{"$f":"Wniosek!F99","v":"00:00:00"},{"$f":"Wniosek!G99","v":"00:00:00"},{"$f":"Wniosek!H99","v":""}]
[{"$f":"Wniosek!A233","v":66},{"$f":"Wniosek!B354","v":""},{"$f":"Wniosek!C354","v":0},{"$f":"ROUND(Wniosek!E354,2)","v":0},{"$f":"Wniosek!D354","v":0},{"$f":"Wniosek!F354","v":0},{"$f":"Wniosek!G354","v":0},{"$f":"Wniosek!H354","v":0},{"$f":"Wniosek!I354","v":0},null,null,{"$f":"A68","v":66},{"$f":"IFERROR(D68/C68,0)","v":0},{"$f":"F68","v":0},{"$f":"IFERROR(N68/M68,0)","v":0},{"$f":"ROUND(N68*C68,2)","v":0},{"$f":"E68*C68","v":0},{"$f":"IFERROR(ROUND(T68*C68,2),0)","v":0},{"$f":"ROUND(T68*C68,2)","v":0},{"$f":"IFERROR(IF((D68-H68)/C68>=$J$3,$J$3,(D68-H68)/C68),0)","v":0},{"$f":"IFERROR(ROUND(I68/C68,2),0)","v":0},{"$f":"D68*0.1","v":0},{"$f":"M68*0.1","v":0},{"$f":"IF(N68>=W68,$K$1,$K$2)","v":"ok"},{"$f":"IF(U68<=$J$3,$K$1,$K$2)","v":"ok"},{"$f":"(R68+P68)-D68","v":0},{"$f":"ROUND(D68-Q68,2)","v":0},{"$f":"Wniosek!F100","v":"00:00:00"},{"$f":"Wniosek!G100","v":"00:00:00"},{"$f":"Wniosek!H100","v":""}]
[{"$f":"Wniosek!A234","v":67},{"$f":"Wniosek!B355","v":""},{"$f":"Wniosek!C355","v":0},{"$f":"ROUND(Wniosek!E355,2)","v":0},{"$f":"Wniosek!D355","v":0},{"$f":"Wniosek!F355","v":0},{"$f":"Wniosek!G355","v":0},{"$f":"Wniosek!H355","v":0},{"$f":"Wniosek!I355","v":0},null,null,67,0,0,0,0,0,0,0,0,0,0,0,"ok","ok",0,0,{"$f":"Wniosek!F101","v":"00:00:00"},{"$f":"Wniosek!G101","v":"00:00:00"},{"$f":"Wniosek!H101","v":""}]
[{"$f":"Wniosek!A235","v":68},{"$f":"Wniosek!B356","v":""},{"$f":"Wniosek!C356","v":0},{"$f":"ROUND(Wniosek!E356,2)","v":0},{"$f":"Wniosek!D356","v":0},{"$f":"Wniosek!F356","v":0},{"$f":"Wniosek!G356","v":0},{"$f":"Wniosek!H356","v":0},{"$f":"Wniosek!I356","v":0},null,null,68,0,0,0,0,0,0,0,0,0,0,0,"ok","ok",0,0,{"$f":"Wniosek!F102","v":"00:00:00"},{"$f":"Wniosek!G102","v":"00:00:00"},{"$f":"Wniosek!H102","v":""}]
[{"$f":"Wniosek!A236","v":69},{"$f":"Wniosek!B357","v":""},{"$f":"Wniosek!C357","v":0},{"$f":"ROUND(Wniosek!E357,2)","v":0},{"$f":"Wniosek!D357","v":0},{"$f":"Wniosek!F357","v":0},{"$f":"Wniosek!G357","v":0},{"$f":"Wniosek!H357","v":0},{"$f":"Wniosek!I357","v":0},null,null,69,0,0,0,0,0,0,0,0,0,0,0,"ok","ok",0,0,{"$f":"Wniosek!F103","v":"00:00:00"},{"$f":"Wniosek!G103","v":"00:00:00"},{"$f":"Wniosek!H103","v":""}]
[{"$f":"Wniosek!A237","v":70},{"$f":"Wniosek!B358","v":""},{"$f":"Wniosek!C358","v":0},{"$f":"ROUND(Wniosek!E358,2)","v":0},{"$f":"Wniosek!D358","v":0},{"$f":"Wniosek!F358","v":0},{"$f":"Wniosek!G358","v":0},{"$f":"Wniosek!H358","v":0},{"$f":"Wniosek!I358","v":0},null,null,70,0,0,0,0,0,0,0,0,0,0,0,"ok","ok",0,0,{"$f":"Wniosek!F104","v":"00:00:00"},{"$f":"Wniosek!G104","v":"00:00:00"},{"$f":"Wniosek!H104","v":""}]
[{"$f":"Wniosek!A238","v":71},{"$f":"Wniosek!B359","v":""},{"$f":"Wniosek!C359","v":0},{"$f":"ROUND(Wniosek!E359,2)","v":0},{"$f":"Wniosek!D359","v":0},{"$f":"Wniosek!F359","v":0},{"$f":"Wniosek!G359","v":0},{"$f":"Wniosek!H359","v":0},{"$f":"Wniosek!I359","v":0},null,null,71,0,0,0,0,0,0,0,0,0,0,0,"ok","ok",0,0,{"$f":"Wniosek!F105","v":"00:00:00"},{"$f":"Wniosek!G105","v":"00:00:00"},{"$f":"Wniosek!H105","v":""}]
[{"$f":"Wniosek!A239","v":72},{"$f":"Wniosek!B360","v":""},{"$f":"Wniosek!C360","v":0},{"$f":"ROUND(Wniosek!E360,2)","v":0},{"$f":"Wniosek!D360","v":0},{"$f":"Wniosek!F360","v":0},{"$f":"Wniosek!G360","v":0},{"$f":"Wniosek!H360","v":0},{"$f":"Wniosek!I360","v":0},null,null,72,0,0,0,0,0,0,0,0,0,0,0,"ok","ok",0,0,{"$f":"Wniosek!F106","v":"00:00:00"},{"$f":"Wniosek!G106","v":"00:00:00"},{"$f":"Wniosek!H106","v":""}]
[{"$f":"Wniosek!A240","v":73},{"$f":"Wniosek!B361","v":""},{"$f":"Wniosek!C361","v":0},{"$f":"ROUND(Wniosek!E361,2)","v":0},{"$f":"Wniosek!D361","v":0},{"$f":"Wniosek!F361","v":0},{"$f":"Wniosek!G361","v":0},{"$f":"Wniosek!H361","v":0},{"$f":"Wniosek!I361","v":0},null,null,73,0,0,0,0,0,0,0,0,0,0,0,"ok","ok",0,0,{"$f":"Wniosek!F107","v":"00:00:00"},{"$f":"Wniosek!G107","v":"00:00:00"},{"$f":"Wniosek!H107","v":""}]
[{"$f":"Wniosek!A241","v":74},{"$f":"Wniosek!B362","v":""},{"$f":"Wniosek!C362","v":0},{"$f":"ROUND(Wniosek!E362,2)","v":0},{"$f":"Wniosek!D362","v":0},{"$f":"Wniosek!F362","v":0},{"$f":"Wniosek!G362","v":0},{"$f":"Wniosek!H362","v":0},{"$f":"Wniosek!I362","v":0},null,null,74,0,0,0,0,0,0,0,0,0,0,0,"ok","ok",0,0,{"$f":"Wniosek!F108","v":"00:00:00"},{"$f":"Wniosek!G108","v":"00:00:00"},{"$f":"Wniosek!H108","v":""}]
[{"$f":"Wniosek!A242","v":75},{"$f":"Wniosek!B363","v":""},{"$f":"Wniosek!C363","v":0},{"$f":"ROUND(Wniosek!E363,2)","v":0},{"$f":"Wniosek!D363","v":0},{"$f":"Wniosek!F363","v":0},{"$f":"Wniosek!G363","v":0},{"$f":"Wniosek!H363","v":0},{"$f":"Wniosek!I363","v":0},null,null,75,0,0,0,0,0,0,0,0,0,0,0,"ok","ok",0,0,{"$f":"Wniosek!F109","v":"00:00:00"},{"$f":"Wniosek!G109","v":"00:00:00"},{"$f":"Wniosek!H109","v":""}]
[{"$f":"Wniosek!A243","v":76},{"$f":"Wniosek!B364","v":""},{"$f":"Wniosek!C364","v":0},{"$f":"ROUND(Wniosek!E364,2)","v":0},{"$f":"Wniosek!D364","v":0},{"$f":"Wniosek!F364","v":0},{"$f":"Wniosek!G364","v":0},{"$f":"Wniosek!H364","v":0},{"$f":"Wniosek!I364","v":0},null,null,76,0,0,0,0,0,0,0,0,0,0,0,"ok","ok",0,0,{"$f":"Wniosek!F110","v":"00:00:00"},{"$f":"Wniosek!G110","v":"00:00:00"},{"$f":"Wniosek!H110","v":""}]
[{"$f":"Wniosek!A244","v":77},{"$f":"Wniosek!B365","v":""},{"$f":"Wniosek!C365","v":0},{"$f":"ROUND(Wniosek!E365,2)","v":0},{"$f":"Wniosek!D365","v":0},{"$f":"Wniosek!F365","v":0},{"$f":"Wniosek!G365","v":0},{"$f":"Wniosek!H365","v":0},{"$f":"Wniosek!I365","v":0},null,null,77,0,0,0,0,0,0,0,0,0,0,0,"ok","ok",0,0,{"$f":"Wniosek!F111","v":"00:00:00"},{"$f":"Wniosek!G111","v":"00:00:00"},{"$f":"Wniosek!H111","v":""}]
[{"$f":"Wniosek!A245","v":78},{"$f":"Wniosek!B366","v":""},{"$f":"Wniosek!C366","v":0},{"$f":"ROUND(Wniosek!E366,2)","v":0},{"$f":"Wniosek!D366","v":0},{"$f":"Wniosek!F366","v":0},{"$f":"Wniosek!G366","v":0},{"$f":"Wniosek!H366","v":0},{"$f":"Wniosek!I366","v":0},null,null,78,0,0,0,0,0,0,0,0,0,0,0,"ok","ok",0,0,{"$f":"Wniosek!F112","v":"00:00:00"},{"$f":"Wniosek!G112","v":"00:00:00"},{"$f":"Wniosek!H112","v":""}]
[{"$f":"Wniosek!A246","v":79},{"$f":"Wniosek!B367","v":""},{"$f":"Wniosek!C367","v":0},{"$f":"ROUND(Wniosek!E367,2)","v":0},{"$f":"Wniosek!D367","v":0},{"$f":"Wniosek!F367","v":0},{"$f":"Wniosek!G367","v":0},{"$f":"Wniosek!H367","v":0},{"$f":"Wniosek!I367","v":0},null,null,79,0,0,0,0,0,0,0,0,0,0,0,"ok","ok",0,0,{"$f":"Wniosek!F113","v":"00:00:00"},{"$f":"Wniosek!G113","v":"00:00:00"},{"$f":"Wniosek!H113","v":""}]
[{"$f":"Wniosek!A247","v":80},{"$f":"Wniosek!B368","v":""},{"$f":"Wniosek!C368","v":0},{"$f":"ROUND(Wniosek!E368,2)","v":0},{"$f":"Wniosek!D368","v":0},{"$f":"Wniosek!F368","v":0},{"$f":"Wniosek!G368","v":0},{"$f":"Wniosek!H368","v":0},{"$f":"Wniosek!I368","v":0},null,null,80,0,0,0,0,0,0,0,0,0,0,0,"ok","ok",0,0,{"$f":"Wniosek!F114","v":"00:00:00"},{"$f":"Wniosek!G114","v":"00:00:00"},{"$f":"Wniosek!H114","v":""}]
[{"$f":"Wniosek!A248","v":81},{"$f":"Wniosek!B369","v":""},{"$f":"Wniosek!C369","v":0},{"$f":"ROUND(Wniosek!E369,2)","v":0},{"$f":"Wniosek!D369","v":0},{"$f":"Wniosek!F369","v":0},{"$f":"Wniosek!G369","v":0},{"$f":"Wniosek!H369","v":0},{"$f":"Wniosek!I369","v":0},null,null,81,0,0,0,0,0,0,0,0,0,0,0,"ok","ok",0,0,{"$f":"Wniosek!F115","v":"00:00:00"},{"$f":"Wniosek!G115","v":"00:00:00"},{"$f":"Wniosek!H115","v":""}]
[{"$f":"Wniosek!A249","v":82},{"$f":"Wniosek!B370","v":""},{"$f":"Wniosek!C370","v":0},{"$f":"ROUND(Wniosek!E370,2)","v":0},{"$f":"Wniosek!D370","v":0},{"$f":"Wniosek!F370","v":0},{"$f":"Wniosek!G370","v":0},{"$f":"Wniosek!H370","v":0},{"$f":"Wniosek!I370","v":0},null,null,82,0,0,0,0,0,0,0,0,0,0,0,"ok","ok",0,0,{"$f":"Wniosek!F116","v":"00:00:00"},{"$f":"Wniosek!G116","v":"00:00:00"},{"$f":"Wniosek!H116","v":""}]
[{"$f":"Wniosek!A250","v":83},{"$f":"Wniosek!B371","v":""},{"$f":"Wniosek!C371","v":0},{"$f":"ROUND(Wniosek!E371,2)","v":0},{"$f":"Wniosek!D371","v":0},{"$f":"Wniosek!F371","v":0},{"$f":"Wniosek!G371","v":0},{"$f":"Wniosek!H371","v":0},{"$f":"Wniosek!I371","v":0},null,null,83,0,0,0,0,0,0,0,0,0,0,0,"ok","ok",0,0,{"$f":"Wniosek!F117","v":"00:00:00"},{"$f":"Wniosek!G117","v":"00:00:00"},{"$f":"Wniosek!H117","v":""}]
[{"$f":"Wniosek!A251","v":84},{"$f":"Wniosek!B372","v":""},{"$f":"Wniosek!C372","v":0},{"$f":"ROUND(Wniosek!E372,2)","v":0},{"$f":"Wniosek!D372","v":0},{"$f":"Wniosek!F372","v":0},{"$f":"Wniosek!G372","v":0},{"$f":"Wniosek!H372","v":0},{"$f":"Wniosek!I372","v":0},null,null,84,0,0,0,0,0,0,0,0,0,0,0,"ok","ok",0,0,{"$f":"Wniosek!F118","v":"00:00:00"},{"$f":"Wniosek!G118","v":"00:00:00"},{"$f":"Wniosek!H118","v":""}]
[{"$f":"Wniosek!A252","v":85},{"$f":"Wniosek!B373","v":""},{"$f":"Wniosek!C373","v":0},{"$f":"ROUND(Wniosek!E373,2)","v":0},{"$f":"Wniosek!D373","v":0},{"$f":"Wniosek!F373","v":0},{"$f":"Wniosek!G373","v":0},{"$f":"Wniosek!H373","v":0},{"$f":"Wniosek!I373","v":0},null,null,85,0,0,0,0,0,0,0,0,0,0,0,"ok","ok",0,0,{"$f":"Wniosek!F119","v":"00:00:00"},{"$f":"Wniosek!G119","v":"00:00:00"},{"$f":"Wniosek!H119","v":""}]
[{"$f":"Wniosek!A253","v":86},{"$f":"Wniosek!B374","v":""},{"$f":"Wniosek!C374","v":0},{"$f":"ROUND(Wniosek!E374,2)","v":0},{"$f":"Wniosek!D374","v":0},{"$f":"Wniosek!F374","v":0},{"$f":"Wniosek!G374","v":0},{"$f":"Wniosek!H374","v":0},{"$f":"Wniosek!I374","v":0},null,null,86,0,0,0,0,0,0,0,0,0,0,0,"ok","ok",0,0,{"$f":"Wniosek!F120","v":"00:00:00"},{"$f":"Wniosek!G120","v":"00:00:00"},{"$f":"Wniosek!H120","v":""}]
[{"$f":"Wniosek!A254","v":87},{"$f":"Wniosek!B375","v":""},{"$f":"Wniosek!C375","v":0},{"$f":"ROUND(Wniosek!E375,2)","v":0},{"$f":"Wniosek!D375","v":0},{"$f":"Wniosek!F375","v":0},{"$f":"Wniosek!G375","v":0},{"$f":"Wniosek!H375","v":0},{"$f":"Wniosek!I375","v":0},null,null,87,0,0,0,0,0,0,0,0,0,0,0,"ok","ok",0,0,{"$f":"Wniosek!F121","v":"00:00:00"},{"$f":"Wniosek!G121","v":"00:00:00"},{"$f":"Wniosek!H121","v":""}]
[{"$f":"Wniosek!A255","v":88},{"$f":"Wniosek!B376","v":""},{"$f":"Wniosek!C376","v":0},{"$f":"ROUND(Wniosek!E376,2)","v":0},{"$f":"Wniosek!D376","v":0},{"$f":"Wniosek!F376","v":0},{"$f":"Wniosek!G376","v":0},{"$f":"Wniosek!H376","v":0},{"$f":"Wniosek!I376","v":0},null,null,88,0,0,0,0,0,0,0,0,0,0,0,"ok","ok",0,0,{"$f":"Wniosek!F122","v":"00:00:00"},{"$f":"Wniosek!G122","v":"00:00:00"},{"$f":"Wniosek!H122","v":""}]
[{"$f":"Wniosek!A256","v":89},{"$f":"Wniosek!B377","v":""},{"$f":"Wniosek!C377","v":0},{"$f":"ROUND(Wniosek!E377,2)","v":0},{"$f":"Wniosek!D377","v":0},{"$f":"Wniosek!F377","v":0},{"$f":"Wniosek!G377","v":0},{"$f":"Wniosek!H377","v":0},{"$f":"Wniosek!I377","v":0},null,null,89,0,0,0,0,0,0,0,0,0,0,0,"ok","ok",0,0,{"$f":"Wniosek!F123","v":"00:00:00"},{"$f":"Wniosek!G123","v":"00:00:00"},{"$f":"Wniosek!H123","v":""}]
[{"$f":"Wniosek!A257","v":90},{"$f":"Wniosek!B378","v":""},{"$f":"Wniosek!C378","v":0},{"$f":"ROUND(Wniosek!E378,2)","v":0},{"$f":"Wniosek!D378","v":0},{"$f":"Wniosek!F378","v":0},{"$f":"Wniosek!G378","v":0},{"$f":"Wniosek!H378","v":0},{"$f":"Wniosek!I378","v":0},null,null,90,0,0,0,0,0,0,0,0,0,0,0,"ok","ok",0,0,{"$f":"Wniosek!F124","v":"00:00:00"},{"$f":"Wniosek!G124","v":"00:00:00"},{"$f":"Wniosek!H124","v":""}]
[{"$f":"Wniosek!A258","v":91},{"$f":"Wniosek!B379","v":""},{"$f":"Wniosek!C379","v":0},{"$f":"ROUND(Wniosek!E379,2)","v":0},{"$f":"Wniosek!D379","v":0},{"$f":"Wniosek!F379","v":0},{"$f":"Wniosek!G379","v":0},{"$f":"Wniosek!H379","v":0},{"$f":"Wniosek!I379","v":0},null,null,91,0,0,0,0,0,0,0,0,0,0,0,"ok","ok",0,0,{"$f":"Wniosek!F125","v":"00:00:00"},{"$f":"Wniosek!G125","v":"00:00:00"},{"$f":"Wniosek!H125","v":""}]
[{"$f":"Wniosek!A259","v":92},{"$f":"Wniosek!B380","v":""},{"$f":"Wniosek!C380","v":0},{"$f":"ROUND(Wniosek!E380,2)","v":0},{"$f":"Wniosek!D380","v":0},{"$f":"Wniosek!F380","v":0},{"$f":"Wniosek!G380","v":0},{"$f":"Wniosek!H380","v":0},{"$f":"Wniosek!I380","v":0},null,null,92,0,0,0,0,0,0,0,0,0,0,0,"ok","ok",0,0,{"$f":"Wniosek!F126","v":"00:00:00"},{"$f":"Wniosek!G126","v":"00:00:00"},{"$f":"Wniosek!H126","v":""}]
[{"$f":"Wniosek!A260","v":93},{"$f":"Wniosek!B381","v":""},{"$f":"Wniosek!C381","v":0},{"$f":"ROUND(Wniosek!E381,2)","v":0},{"$f":"Wniosek!D381","v":0},{"$f":"Wniosek!F381","v":0},{"$f":"Wniosek!G381","v":0},{"$f":"Wniosek!H381","v":0},{"$f":"Wniosek!I381","v":0},null,null,93,0,0,0,0,0,0,0,0,0,0,0,"ok","ok",0,0,{"$f":"Wniosek!F127","v":"00:00:00"},{"$f":"Wniosek!G127","v":"00:00:00"},{"$f":"Wniosek!H127","v":""}]
[{"$f":"Wniosek!A261","v":94},{"$f":"Wniosek!B382","v":""},{"$f":"Wniosek!C382","v":0},{"$f":"ROUND(Wniosek!E382,2)","v":0},{"$f":"Wniosek!D382","v":0},{"$f":"Wniosek!F382","v":0},{"$f":"Wniosek!G382","v":0},{"$f":"Wniosek!H382","v":0},{"$f":"Wniosek!I382","v":0},null,null,94,0,0,0,0,0,0,0,0,0,0,0,"ok","ok",0,0,{"$f":"Wniosek!F128","v":"00:00:00"},{"$f":"Wniosek!G128","v":"00:00:00"},{"$f":"Wniosek!H128","v":""}]
[{"$f":"Wniosek!A262","v":95},{"$f":"Wniosek!B383","v":""},{"$f":"Wniosek!C383","v":0},{"$f":"ROUND(Wniosek!E383,2)","v":0},{"$f":"Wniosek!D383","v":0},{"$f":"Wniosek!F383","v":0},{"$f":"Wniosek!G383","v":0},{"$f":"Wniosek!H383","v":0},{"$f":"Wniosek!I383","v":0},null,null,95,0,0,0,0,0,0,0,0,0,0,0,"ok","ok",0,0,{"$f":"Wniosek!F129","v":"00:00:00"},{"$f":"Wniosek!G129","v":"00:00:00"},{"$f":"Wniosek!H129","v":""}]
[{"$f":"Wniosek!A263","v":96},{"$f":"Wniosek!B384","v":""},{"$f":"Wniosek!C384","v":0},{"$f":"ROUND(Wniosek!E384,2)","v":0},{"$f":"Wniosek!D384","v":0},{"$f":"Wniosek!F384","v":0},{"$f":"Wniosek!G384","v":0},{"$f":"Wniosek!H384","v":0},{"$f":"Wniosek!I384","v":0},null,null,96,0,0,0,0,0,0,0,0,0,0,0,"ok","ok",0,0,{"$f":"Wniosek!F130","v":"00:00:00"},{"$f":"Wniosek!G130","v":"00:00:00"},{"$f":"Wniosek!H130","v":""}]
[{"$f":"Wniosek!A264","v":97},{"$f":"Wniosek!B385","v":""},{"$f":"Wniosek!C385","v":0},{"$f":"ROUND(Wniosek!E385,2)","v":0},{"$f":"Wniosek!D385","v":0},{"$f":"Wniosek!F385","v":0},{"$f":"Wniosek!G385","v":0},{"$f":"Wniosek!H385","v":0},{"$f":"Wniosek!I385","v":0},null,null,97,0,0,0,0,0,0,0,0,0,0,0,"ok","ok",0,0,{"$f":"Wniosek!F131","v":"00:00:00"},{"$f":"Wniosek!G131","v":"00:00:00"},{"$f":"Wniosek!H131","v":""}]
[{"$f":"Wniosek!A265","v":98},{"$f":"Wniosek!B386","v":""},{"$f":"Wniosek!C386","v":0},{"$f":"ROUND(Wniosek!E386,2)","v":0},{"$f":"Wniosek!D386","v":0},{"$f":"Wniosek!F386","v":0},{"$f":"Wniosek!G386","v":0},{"$f":"Wniosek!H386","v":0},{"$f":"Wniosek!I386","v":0},null,null,98,0,0,0,0,0,0,0,0,0,0,0,"ok","ok",0,0,{"$f":"Wniosek!F132","v":"00:00:00"},{"$f":"Wniosek!G132","v":"00:00:00"},{"$f":"Wniosek!H132","v":""}]
[{"$f":"Wniosek!A266","v":99},{"$f":"Wniosek!B387","v":""},{"$f":"Wniosek!C387","v":0},{"$f":"ROUND(Wniosek!E387,2)","v":0},{"$f":"Wniosek!D387","v":0},{"$f":"Wniosek!F387","v":0},{"$f":"Wniosek!G387","v":0},{"$f":"Wniosek!H387","v":0},{"$f":"Wniosek!I387","v":0},null,null,99,0,0,0,0,0,0,0,0,0,0,0,"ok","ok",0,0,{"$f":"Wniosek!F133","v":"00:00:00"},{"$f":"Wniosek!G133","v":"00:00:00"},{"$f":"Wniosek!H133","v":""}]
[{"$f":"Wniosek!A267","v":100},{"$f":"Wniosek!B388","v":""},{"$f":"Wniosek!C388","v":0},{"$f":"ROUND(Wniosek!E388,2)","v":0},{"$f":"Wniosek!D388","v":0},{"$f":"Wniosek!F388","v":0},{"$f":"Wniosek!G388","v":0},{"$f":"Wniosek!H388","v":0},{"$f":"Wniosek!I388","v":0},null,null,100,0,0,0,0,0,0,0,0,0,0,0,"ok","ok",0,0,{"$f":"Wniosek!F134","v":"00:00:00"},{"$f":"Wniosek!G134","v":"00:00:00"},{"$f":"Wniosek!H134","v":""}]
[{"$f":"Wniosek!A268","v":101},{"$f":"Wniosek!B389","v":""},{"$f":"Wniosek!C389","v":0},{"$f":"ROUND(Wniosek!E389,2)","v":0},{"$f":"Wniosek!D389","v":0},{"$f":"Wniosek!F389","v":0},{"$f":"Wniosek!G389","v":0},{"$f":"Wniosek!H389","v":0},{"$f":"Wniosek!I389","v":0},null,null,101,0,0,0,0,0,0,0,0,0,0,0,"ok","ok",0,0,{"$f":"Wniosek!F135","v":"00:00:00"},{"$f":"Wniosek!G135","v":"00:00:00"},{"$f":"Wniosek!H135","v":""}]
[{"$f":"Wniosek!A269","v":102},{"$f":"Wniosek!B390","v":""},{"$f":"Wniosek!C390","v":0},{"$f":"ROUND(Wniosek!E390,2)","v":0},{"$f":"Wniosek!D390","v":0},{"$f":"Wniosek!F390","v":0},{"$f":"Wniosek!G390","v":0},{"$f":"Wniosek!H390","v":0},{"$f":"Wniosek!I390","v":0},null,null,102,0,0,0,0,0,0,0,0,0,0,0,"ok","ok",0,0,{"$f":"Wniosek!F136","v":"00:00:00"},{"$f":"Wniosek!G136","v":"00:00:00"},{"$f":"Wniosek!H136","v":""}]
[{"$f":"Wniosek!A270","v":103},{"$f":"Wniosek!B391","v":""},{"$f":"Wniosek!C391","v":0},{"$f":"ROUND(Wniosek!E391,2)","v":0},{"$f":"Wniosek!D391","v":0},{"$f":"Wniosek!F391","v":0},{"$f":"Wniosek!G391","v":0},{"$f":"Wniosek!H391","v":0},{"$f":"Wniosek!I391","v":0},null,null,103,0,0,0,0,0,0,0,0,0,0,0,"ok","ok",0,0,{"$f":"Wniosek!F137","v":"00:00:00"},{"$f":"Wniosek!G137","v":"00:00:00"},{"$f":"Wniosek!H137","v":""}]
[{"$f":"Wniosek!A271","v":104},{"$f":"Wniosek!B392","v":""},{"$f":"Wniosek!C392","v":0},{"$f":"ROUND(Wniosek!E392,2)","v":0},{"$f":"Wniosek!D392","v":0},{"$f":"Wniosek!F392","v":0},{"$f":"Wniosek!G392","v":0},{"$f":"Wniosek!H392","v":0},{"$f":"Wniosek!I392","v":0},null,null,104,0,0,0,0,0,0,0,0,0,0,0,"ok","ok",0,0,{"$f":"Wniosek!F138","v":"00:00:00"},{"$f":"Wniosek!G138","v":"00:00:00"},{"$f":"Wniosek!H138","v":""}]
[{"$f":"Wniosek!A272","v":105},{"$f":"Wniosek!B393","v":""},{"$f":"Wniosek!C393","v":0},{"$f":"ROUND(Wniosek!E393,2)","v":0},{"$f":"Wniosek!D393","v":0},{"$f":"Wniosek!F393","v":0},{"$f":"Wniosek!G393","v":0},{"$f":"Wniosek!H393","v":0},{"$f":"Wniosek!I393","v":0},null,null,105,0,0,0,0,0,0,0,0,0,0,0,"ok","ok",0,0,{"$f":"Wniosek!F139","v":"00:00:00"},{"$f":"Wniosek!G139","v":"00:00:00"},{"$f":"Wniosek!H139","v":""}]
[{"$f":"Wniosek!A273","v":106},{"$f":"Wniosek!B394","v":""},{"$f":"Wniosek!C394","v":0},{"$f":"ROUND(Wniosek!E394,2)","v":0},{"$f":"Wniosek!D394","v":0},{"$f":"Wniosek!F394","v":0},{"$f":"Wniosek!G394","v":0},{"$f":"Wniosek!H394","v":0},{"$f":"Wniosek!I394","v":0},null,null,106,0,0,0,0,0,0,0,0,0,0,0,"ok","ok",0,0,{"$f":"Wniosek!F140","v":"00:00:00"},{"$f":"Wniosek!G140","v":"00:00:00"}]
[{"$f":"Wniosek!A274","v":107},{"$f":"Wniosek!B395","v":""},{"$f":"Wniosek!C395","v":0},{"$f":"ROUND(Wniosek!E395,2)","v":0},{"$f":"Wniosek!D395","v":0},{"$f":"Wniosek!F395","v":0},{"$f":"Wniosek!G395","v":0},{"$f":"Wniosek!H395","v":0},{"$f":"Wniosek!I395","v":0},null,null,107,0,0,0,0,0,0,0,0,0,0,0,"ok","ok",0,0,{"$f":"Wniosek!F141","v":"00:00:00"},{"$f":"Wniosek!G141","v":"00:00:00"}]
[{"$f":"Wniosek!A275","v":108},{"$f":"Wniosek!B396","v":""},{"$f":"Wniosek!C396","v":0},{"$f":"ROUND(Wniosek!E396,2)","v":0},{"$f":"Wniosek!D396","v":0},{"$f":"Wniosek!F396","v":0},{"$f":"Wniosek!G396","v":0},{"$f":"Wniosek!H396","v":0},{"$f":"Wniosek!I396","v":0},null,null,108,0,0,0,0,0,0,0,0,0,0,0,"ok","ok",0,0,{"$f":"Wniosek!F142","v":"00:00:00"},{"$f":"Wniosek!G142","v":"00:00:00"}]
[{"$f":"Wniosek!A276","v":109},{"$f":"Wniosek!B397","v":""},{"$f":"Wniosek!C397","v":0},{"$f":"ROUND(Wniosek!E397,2)","v":0},{"$f":"Wniosek!D397","v":0},{"$f":"Wniosek!F397","v":0},{"$f":"Wniosek!G397","v":0},{"$f":"Wniosek!H397","v":0},{"$f":"Wniosek!I397","v":0},null,null,109,0,0,0,0,0,0,0,0,0,0,0,"ok","ok",0,0,{"$f":"Wniosek!F143","v":"00:00:00"},{"$f":"Wniosek!G143","v":"00:00:00"}]
[{"$f":"Wniosek!A277","v":110},{"$f":"Wniosek!B398","v":""},{"$f":"Wniosek!C398","v":0},{"$f":"ROUND(Wniosek!E398,2)","v":0},{"$f":"Wniosek!D398","v":0},{"$f":"Wniosek!F398","v":0},{"$f":"Wniosek!G398","v":0},{"$f":"Wniosek!H398","v":0},{"$f":"Wniosek!I398","v":0},null,null,110,0,0,0,0,0,0,0,0,0,0,0,"ok","ok",0,0,{"$f":"Wniosek!F144","v":"00:00:00"},{"$f":"Wniosek!G144","v":"00:00:00"}]
[{"$f":"Wniosek!A278","v":111},{"$f":"Wniosek!B399","v":""},{"$f":"Wniosek!C399","v":0},{"$f":"ROUND(Wniosek!E399,2)","v":0},{"$f":"Wniosek!D399","v":0},{"$f":"Wniosek!F399","v":0},{"$f":"Wniosek!G399","v":0},{"$f":"Wniosek!H399","v":0},{"$f":"Wniosek!I399","v":0},null,null,111,0,0,0,0,0,0,0,0,0,0,0,"ok","ok",0,0,{"$f":"Wniosek!F145","v":"00:00:00"},{"$f":"Wniosek!G145","v":"00:00:00"},{"$f":"Wniosek!H145","v":""}]
[{"$f":"Wniosek!A279","v":112},{"$f":"Wniosek!B400","v":""},{"$f":"Wniosek!C400","v":0},{"$f":"ROUND(Wniosek!E400,2)","v":0},{"$f":"Wniosek!D400","v":0},{"$f":"Wniosek!F400","v":0},{"$f":"Wniosek!G400","v":0},{"$f":"Wniosek!H400","v":0},{"$f":"Wniosek!I400","v":0},null,null,112,0,0,0,0,0,0,0,0,0,0,0,"ok","ok",0,0,{"$f":"Wniosek!F146","v":"00:00:00"},{"$f":"Wniosek!G146","v":"00:00:00"},{"$f":"Wniosek!H146","v":""}]
[{"$f":"Wniosek!A280","v":113},{"$f":"Wniosek!B401","v":""},{"$f":"Wniosek!C401","v":0},{"$f":"ROUND(Wniosek!E401,2)","v":0},{"$f":"Wniosek!D401","v":0},{"$f":"Wniosek!F401","v":0},{"$f":"Wniosek!G401","v":0},{"$f":"Wniosek!H401","v":0},{"$f":"Wniosek!I401","v":0},null,null,113,0,0,0,0,0,0,0,0,0,0,0,"ok","ok",0,0,{"$f":"Wniosek!F147","v":"00:00:00"},{"$f":"Wniosek!G147","v":"00:00:00"},{"$f":"Wniosek!H147","v":""}]
[{"$f":"Wniosek!A281","v":114},{"$f":"Wniosek!B402","v":""},{"$f":"Wniosek!C402","v":0},{"$f":"ROUND(Wniosek!E402,2)","v":0},{"$f":"Wniosek!D402","v":0},{"$f":"Wniosek!F402","v":0},{"$f":"Wniosek!G402","v":0},{"$f":"Wniosek!H402","v":0},{"$f":"Wniosek!I402","v":0},null,null,114,0,0,0,0,0,0,0,0,0,0,0,"ok","ok",0,0,{"$f":"Wniosek!F148","v":"00:00:00"},{"$f":"Wniosek!G148","v":"00:00:00"},{"$f":"Wniosek!H148","v":""}]
[{"$f":"Wniosek!A282","v":115},{"$f":"Wniosek!B403","v":""},{"$f":"Wniosek!C403","v":0},{"$f":"ROUND(Wniosek!E403,2)","v":0},{"$f":"Wniosek!D403","v":0},{"$f":"Wniosek!F403","v":0},{"$f":"Wniosek!G403","v":0},{"$f":"Wniosek!H403","v":0},{"$f":"Wniosek!I403","v":0},null,null,115,0,0,0,0,0,0,0,0,0,0,0,"ok","ok",0,0,{"$f":"Wniosek!F149","v":"00:00:00"},{"$f":"Wniosek!G149","v":"00:00:00"},{"$f":"Wniosek!H149","v":""}]
["Suma",null,{"$f":"SUM(C3:C117)","v":0},{"$f":"ROUND(Wniosek!E404,2)","v":0},null,null,null,{"$f":"SUM(H3:H117)","v":0},{"$f":"Wniosek!I404","v":0},null,null,null,null,null,null,{"$f":"ROUND(N118*C118,2)","v":0},{"$f":"SUM(Q3:Q117)","v":0},{"$f":"IFERROR(ROUND(T118*C118,2),0)","v":0},{"$f":"ROUND(T118*C118,2)","v":0},null,null,{"$f":"D118*0.1","v":0}]

{"sheet":"Weryfikacja 3","index":3,"n_rows":118,"n_cols":32,"rows_kept":118,"cut":false,"hidden":true,"merged":[[0,1,0,9]]}
[null,"Dane z wniosku",null,null,null,null,null,null,null,null,"ok","Wer.",null,null,null,null,null,null,null,null,null,null,null,null,null,null,null,null,null,null,null,"Zgodność danych z załącznikiem nr 1"]
["l.p","NAZWA LINII","WOZOKILOMETRY","DEFICYT","CENA USŁUGI","WKŁAD WŁASNY/KM [ZŁ]","WKŁAD WŁASNY [%]","WKŁAD WŁASNY [ZŁ]","KWOTA DOPŁATY","STAWKA MAX Z UMOWY","X",{"$f":"A2","v":"l.p"},"Cena usługi","Wkład własny/km [zł]","Wkład własny [%]","Wkład własny [zł]","Def z ceny usł","Kwota dopłaty","Max kwota dopł na podst wk. wł.","Max kwota dopł na podst wk wł/wzkm ","Kwota dopłaty/wozokm","10% z deficytu ","10 % z ceny usługi","warunek 10%","max 1 (3) zł/wzkm","Różnica w finansowaniu","Różnica def z zaokrągleń",{"$f":"Wniosek!F33","v":"Data uruchomienia linii komunikacyjnej wskazana we wniosku o objęcie dopłatą."},{"$f":"Wniosek!G33","v":"Data uruchomienia linii komunikacyjnej."},"art. 11e",null,{"$f":"IF(Miesiące!P11=Wniosek!Q213,'Weryfikacja 3'!$K$1,'Weryfikacja 3'!$K$2)","v":"ok"}]
[{"$f":"Wniosek!A168","v":1},{"$f":"Wniosek!B410","v":""},{"$f":"Wniosek!C410","v":0},{"$f":"ROUND(Wniosek!E410,2)","v":0},{"$f":"Wniosek!D410","v":0},{"$f":"Wniosek!F410","v":0},{"$f":"Wniosek!G410","v":0},{"$f":"Wniosek!H410","v":0},{"$f":"Wniosek!I410","v":0},3,null,1,{"$f":"IFERROR(D3/C3,0)","v":0},{"$f":"F3","v":0},{"$f":"IFERROR(N3/M3,0)","v":0},{"$f":"ROUND(N3*C3,2)","v":0},{"$f":"E3*C3","v":0},{"$f":"IFERROR(ROUND(T3*C3,2),0)","v":0},{"$f":"ROUND(T3*C3,2)","v":0},{"$f":"IFERROR(IF((D3-H3)/C3>=$J$3,$J$3,(D3-H3)/C3),0)","v":0},{"$f":"IFERROR(ROUND(I3/C3,2),0)","v":0},{"$f":"D3*0.1","v":0},{"$f":"M3*0.1","v":0},{"$f":"IF(N3>=W3,$K$1,$K$2)","v":"ok"},{"$f":"IF(U3<=$J$3,$K$1,$K$2)","v":"ok"},{"$f":"(R3+P3)-D3","v":0},{"$f":"ROUND(D3-Q3,2)","v":0},{"$f":"Wniosek!F35","v":"00:00:00"},{"$f":"Wniosek!G35","v":"00:00:00"},{"$f":"Wniosek!H35","v":""}]
[{"$f":"Wniosek!A169","v":2},{"$f":"Wniosek!B411","v":""},{"$f":"Wniosek!C411","v":0},{"$f":"ROUND(Wniosek!E411,2)","v":0},{"$f":"Wniosek!D411","v":0},{"$f":"Wniosek!F411","v":0},{"$f":"Wniosek!G411","v":0},{"$f":"Wniosek!H411","v":0},{"$f":"Wniosek!I411","v":0},null,null,{"$f":"A4","v":2},{"$f":"IFERROR(D4/C4,0)","v":0},{"$f":"F4","v":0},{"$f":"IFERROR(N4/M4,0)","v":0},{"$f":"ROUND(N4*C4,2)","v":0},{"$f":"E4*C4","v":0},{"$f":"IFERROR(ROUND(T4*C4,2),0)","v":0},{"$f":"ROUND(T4*C4,2)","v":0},{"$f":"IFERROR(IF((D4-H4)/C4>=$J$3,$J$3,(D4-H4)/C4),0)","v":0},{"$f":"IFERROR(ROUND(I4/C4,2),0)","v":0},{"$f":"D4*0.1","v":0},{"$f":"M4*0.1","v":0},{"$f":"IF(N4>=W4,$K$1,$K$2)","v":"ok"},{"$f":"IF(U4<=$J$3,$K$1,$K$2)","v":"ok"},{"$f":"(R4+P4)-D4","v":0},{"$f":"ROUND(D4-Q4,2)","v":0},{"$f":"Wniosek!F36","v":"00:00:00"},{"$f":"Wniosek!G36","v":"00:00:00"},{"$f":"Wniosek!H36","v":""}]
[{"$f":"Wniosek!A170","v":3},{"$f":"Wniosek!B412","v":""},{"$f":"Wniosek!C412","v":0},{"$f":"ROUND(Wniosek!E412,2)","v":0},{"$f":"Wniosek!D412","v":0},{"$f":"Wniosek!F412","v":0},{"$f":"Wniosek!G412","v":0},{"$f":"Wniosek!H412","v":0},{"$f":"Wniosek!I412","v":0},null,null,3,0,0,0,0,0,0,0,0,0,0,0,"ok","ok",0,0,{"$f":"Wniosek!F37","v":"00:00:00"},{"$f":"Wniosek!G37","v":"00:00:00"},{"$f":"Wniosek!H37","v":""}]
[{"$f":"Wniosek!A171","v":4},{"$f":"Wniosek!B413","v":""},{"$f":"Wniosek!C413","v":0},{"$f":"ROUND(Wniosek!E413,2)","v":0},{"$f":"Wniosek!D413","v":0},{"$f":"Wniosek!F413","v":0},{"$f":"Wniosek!G413","v":0},{"$f":"Wniosek!H413","v":0},{"$f":"Wniosek!I413","v":0},null,null,4,0,0,0,0,0,0,0,0,0,0,0,"ok","ok",0,0,{"$f":"Wniosek!F38","v":"00:00:00"},{"$f":"Wniosek!G38","v":"00:00:00"},{"$f":"Wniosek!H38","v":""}]
[{"$f":"Wniosek!A172","v":5},{"$f":"Wniosek!B414","v":""},{"$f":"Wniosek!C414","v":0},{"$f":"ROUND(Wniosek!E414,2)","v":0},{"$f":"Wniosek!D414","v":0},{"$f":"Wniosek!F414","v":0},{"$f":"Wniosek!G414","v":0},{"$f":"Wniosek!H414","v":0},{"$f":"Wniosek!I414","v":0},null,null,5,0,0,0,0,0,0,0,0,0,0,0,"ok","ok",0,0,{"$f":"Wniosek!F39","v":"00:00:00"},{"$f":"Wniosek!G39","v":"00:00:00"},{"$f":"Wniosek!H39","v":""}]
[{"$f":"Wniosek!A173","v":6},{"$f":"Wniosek!B415","v":""},{"$f":"Wniosek!C415","v":0},{"$f":"ROUND(Wniosek!E415,2)","v":0},{"$f":"Wniosek!D415","v":0},{"$f":"Wniosek!F415","v":0},{"$f":"Wniosek!G415","v":0},{"$f":"Wniosek!H415","v":0},{"$f":"Wniosek!I415","v":0},null,null,6,0,0,0,0,0,0,0,0,0,0,0,"ok","ok",0,0,{"$f":"Wniosek!F40","v":"00:00:00"},{"$f":"Wniosek!G40","v":"00:00:00"},{"$f":"Wniosek!H40","v":""}]
[{"$f":"Wniosek!A174","v":7},{"$f":"Wniosek!B416","v":""},{"$f":"Wniosek!C416","v":0},{"$f":"ROUND(Wniosek!E416,2)","v":0},{"$f":"Wniosek!D416","v":0},{"$f":"Wniosek!F416","v":0},{"$f":"Wniosek!G416","v":0},{"$f":"Wniosek!H416","v":0},{"$f":"Wniosek!I416","v":0},null,null,7,0,0,0,0,0,0,0,0,0,0,0,"ok","ok",0,0,{"$f":"Wniosek!F41","v":"00:00:00"},{"$f":"Wniosek!G41","v":"00:00:00"},{"$f":"Wniosek!H41","v":""}]
[{"$f":"Wniosek!A175","v":8},{"$f":"Wniosek!B417","v":""},{"$f":"Wniosek!C417","v":0},{"$f":"ROUND(Wniosek!E417,2)","v":0},{"$f":"Wniosek!D417","v":0},{"$f":"Wniosek!F417","v":0},{"$f":"Wniosek!G417","v":0},{"$f":"Wniosek!H417","v":0},{"$f":"Wniosek!I417","v":0},null,null,8,0,0,0,0,0,0,0,0,0,0,0,"ok","ok",0,0,{"$f":"Wniosek!F42","v":"00:00:00"},{"$f":"Wniosek!G42","v":"00:00:00"},{"$f":"Wniosek!H42","v":""}]
[{"$f":"Wniosek!A176","v":9},{"$f":"Wniosek!B418","v":""},{"$f":"Wniosek!C418","v":0},{"$f":"ROUND(Wniosek!E418,2)","v":0},{"$f":"Wniosek!D418","v":0},{"$f":"Wniosek!F418","v":0},{"$f":"Wniosek!G418","v":0},{"$f":"Wniosek!H418","v":0},{"$f":"Wniosek!I418","v":0},null,null,9,0,0,0,0,0,0,0,0,0,0,0,"ok","ok",0,0,{"$f":"Wniosek!F43","v":"00:00:00"},{"$f":"Wniosek!G43","v":"00:00:00"},{"$f":"Wniosek!H43","v":""}]
[{"$f":"Wniosek!A177","v":10},{"$f":"Wniosek!B419","v":""},{"$f":"Wniosek!C419","v":0},{"$f":"ROUND(Wniosek!E419,2)","v":0},{"$f":"Wniosek!D419","v":0},{"$f":"Wniosek!F419","v":0},{"$f":"Wniosek!G419","v":0},{"$f":"Wniosek!H419","v":0},{"$f":"Wniosek!I419","v":0},null,null,10,0,0,0,0,0,0,0,0,0,0,0,"ok","ok",0,0,{"$f":"Wniosek!F44","v":"00:00:00"},{"$f":"Wniosek!G44","v":"00:00:00"},{"$f":"Wniosek!H44","v":""}]
[{"$f":"Wniosek!A178","v":11},{"$f":"Wniosek!B420","v":""},{"$f":"Wniosek!C420","v":0},{"$f":"ROUND(Wniosek!E420,2)","v":0},{"$f":"Wniosek!D420","v":0},{"$f":"Wniosek!F420","v":0},{"$f":"Wniosek!G420","v":0},{"$f":"Wniosek!H420","v":0},{"$f":"Wniosek!I420","v":0},null,null,11,0,0,0,0,0,0,0,0,0,0,0,"ok","ok",0,0,{"$f":"Wniosek!F45","v":"00:00:00"},{"$f":"Wniosek!G45","v":"00:00:00"},{"$f":"Wniosek!H45","v":""}]
[{"$f":"Wniosek!A179","v":12},{"$f":"Wniosek!B421","v":""},{"$f":"Wniosek!C421","v":0},{"$f":"ROUND(Wniosek!E421,2)","v":0},{"$f":"Wniosek!D421","v":0},{"$f":"Wniosek!F421","v":0},{"$f":"Wniosek!G421","v":0},{"$f":"Wniosek!H421","v":0},{"$f":"Wniosek!I421","v":0},null,null,12,0,0,0,0,0,0,0,0,0,0,0,"ok","ok",0,0,{"$f":"Wniosek!F46","v":"00:00:00"},{"$f":"Wniosek!G46","v":"00:00:00"},{"$f":"Wniosek!H46","v":""}]
[{"$f":"Wniosek!A180","v":13},{"$f":"Wniosek!B422","v":""},{"$f":"Wniosek!C422","v":0},{"$f":"ROUND(Wniosek!E422,2)","v":0},{"$f":"Wniosek!D422","v":0},{"$f":"Wniosek!F422","v":0},{"$f":"Wniosek!G422","v":0},{"$f":"Wniosek!H422","v":0},{"$f":"Wniosek!I422","v":0},null,null,13,0,0,0,0,0,0,0,0,0,0,0,"ok","ok",0,0,{"$f":"Wniosek!F47","v":"00:00:00"},{"$f":"Wniosek!G47","v":"00:00:00"},{"$f":"Wniosek!H47","v":""}]
[{"$f":"Wniosek!A181","v":14},{"$f":"Wniosek!B423","v":""},{"$f":"Wniosek!C423","v":0},{"$f":"ROUND(Wniosek!E423,2)","v":0},{"$f":"Wniosek!D423","v":0},{"$f":"Wniosek!F423","v":0},{"$f":"Wniosek!G423","v":0},{"$f":"Wniosek!H423","v":0},{"$f":"Wniosek!I423","v":0},null,null,14,0,0,0,0,0,0,0,0,0,0,0,"ok","ok",0,0,{"$f":"Wniosek!F48","v":"00:00:00"},{"$f":"Wniosek!G48","v":"00:00:00"},{"$f":"Wniosek!H48","v":""}]
[{"$f":"Wniosek!A182","v":15},{"$f":"Wniosek!B424","v":""},{"$f":"Wniosek!C424","v":0},{"$f":"ROUND(Wniosek!E424,2)","v":0},{"$f":"Wniosek!D424","v":0},{"$f":"Wniosek!F424","v":0},{"$f":"Wniosek!G424","v":0},{"$f":"Wniosek!H424","v":0},{"$f":"Wniosek!I424","v":0},null,null,15,0,0,0,0,0,0,0,0,0,0,0,"ok","ok",0,0,{"$f":"Wniosek!F49","v":"00:00:00"},{"$f":"Wniosek!G49","v":"00:00:00"},{"$f":"Wniosek!H49","v":""}]
[{"$f":"Wniosek!A183","v":16},{"$f":"Wniosek!B425","v":""},{"$f":"Wniosek!C425","v":0},{"$f":"ROUND(Wniosek!E425,2)","v":0},{"$f":"Wniosek!D425","v":0},{"$f":"Wniosek!F425","v":0},{"$f":"Wniosek!G425","v":0},{"$f":"Wniosek!H425","v":0},{"$f":"Wniosek!I425","v":0},null,null,16,0,0,0,0,0,0,0,0,0,0,0,"ok","ok",0,0,{"$f":"Wniosek!F50","v":"00:00:00"},{"$f":"Wniosek!G50","v":"00:00:00"},{"$f":"Wniosek!H50","v":""}]
[{"$f":"Wniosek!A184","v":17},{"$f":"Wniosek!B426","v":""},{"$f":"Wniosek!C426","v":0},{"$f":"ROUND(Wniosek!E426,2)","v":0},{"$f":"Wniosek!D426","v":0},{"$f":"Wniosek!F426","v":0},{"$f":"Wniosek!G426","v":0},{"$f":"Wniosek!H426","v":0},{"$f":"Wniosek!I426","v":0},null,null,17,0,0,0,0,0,0,0,0,0,0,0,"ok","ok",0,0,{"$f":"Wniosek!F51","v":"00:00:00"},{"$f":"Wniosek!G51","v":"00:00:00"},{"$f":"Wniosek!H51","v":""}]
[{"$f":"Wniosek!A185","v":18},{"$f":"Wniosek!B427","v":""},{"$f":"Wniosek!C427","v":0},{"$f":"ROUND(Wniosek!E427,2)","v":0},{"$f":"Wniosek!D427","v":0},{"$f":"Wniosek!F427","v":0},{"$f":"Wniosek!G427","v":0},{"$f":"Wniosek!H427","v":0},{"$f":"Wniosek!I427","v":0},null,null,18,0,0,0,0,0,0,0,0,0,0,0,"ok","ok",0,0,{"$f":"Wniosek!F52","v":"00:00:00"},{"$f":"Wniosek!G52","v":"00:00:00"},{"$f":"Wniosek!H52","v":""}]
[{"$f":"Wniosek!A186","v":19},{"$f":"Wniosek!B428","v":""},{"$f":"Wniosek!C428","v":0},{"$f":"ROUND(Wniosek!E428,2)","v":0},{"$f":"Wniosek!D428","v":0},{"$f":"Wniosek!F428","v":0},{"$f":"Wniosek!G428","v":0},{"$f":"Wniosek!H428","v":0},{"$f":"Wniosek!I428","v":0},null,null,19,0,0,0,0,0,0,0,0,0,0,0,"ok","ok",0,0,{"$f":"Wniosek!F53","v":"00:00:00"},{"$f":"Wniosek!G53","v":"00:00:00"},{"$f":"Wniosek!H53","v":""}]
[{"$f":"Wniosek!A187","v":20},{"$f":"Wniosek!B429","v":""},{"$f":"Wniosek!C429","v":0},{"$f":"ROUND(Wniosek!E429,2)","v":0},{"$f":"Wniosek!D429","v":0},{"$f":"Wniosek!F429","v":0},{"$f":"Wniosek!G429","v":0},{"$f":"Wniosek!H429","v":0},{"$f":"Wniosek!I429","v":0},null,null,20,0,0,0,0,0,0,0,0,0,0,0,"ok","ok",0,0,{"$f":"Wniosek!F54","v":"00:00:00"},{"$f":"Wniosek!G54","v":"00:00:00"},{"$f":"Wniosek!H54","v":""}]
[{"$f":"Wniosek!A188","v":21},{"$f":"Wniosek!B430","v":""},{"$f":"Wniosek!C430","v":0},{"$f":"ROUND(Wniosek!E430,2)","v":0},{"$f":"Wniosek!D430","v":0},{"$f":"Wniosek!F430","v":0},{"$f":"Wniosek!G430","v":0},{"$f":"Wniosek!H430","v":0},{"$f":"Wniosek!I430","v":0},null,null,21,0,0,0,0,0,0,0,0,0,0,0,"ok","ok",0,0,{"$f":"Wniosek!F55","v":"00:00:00"},{"$f":"Wniosek!G55","v":"00:00:00"},{"$f":"Wniosek!H55","v":""}]
[{"$f":"Wniosek!A189","v":22},{"$f":"Wniosek!B431","v":""},{"$f":"Wniosek!C431","v":0},{"$f":"ROUND(Wniosek!E431,2)","v":0},{"$f":"Wniosek!D431","v":0},{"$f":"Wniosek!F431","v":0},{"$f":"Wniosek!G431","v":0},{"$f":"Wniosek!H431","v":0},{"$f":"Wniosek!I431","v":0},null,null,22,0,0,0,0,0,0,0,0,0,0,0,"ok","ok",0,0,{"$f":"Wniosek!F56","v":"00:00:00"},{"$f":"Wniosek!G56","v":"00:00:00"},{"$f":"Wniosek!H56","v":""}]
[{"$f":"Wniosek!A190","v":23},{"$f":"Wniosek!B432","v":""},{"$f":"Wniosek!C432","v":0},{"$f":"ROUND(Wniosek!E432,2)","v":0},{"$f":"Wniosek!D432","v":0},{"$f":"Wniosek!F432","v":0},{"$f":"Wniosek!G432","v":0},{"$f":"Wniosek!H432","v":0},{"$f":"Wniosek!I432","v":0},null,null,23,0,0,0,0,0,0,0,0,0,0,0,"ok","ok",0,0,{"$f":"Wniosek!F57","v":"00:00:00"},{"$f":"Wniosek!G57","v":"00:00:00"},{"$f":"Wniosek!H57","v":""}]
[{"$f":"Wniosek!A191","v":24},{"$f":"Wniosek!B433","v":""},{"$f":"Wniosek!C433","v":0},{"$f":"ROUND(Wniosek!E433,2)","v":0},{"$f":"Wniosek!D433","v":0},{"$f":"Wniosek!F433","v":0},{"$f":"Wniosek!G433","v":0},{"$f":"Wniosek!H433","v":0},{"$f":"Wniosek!I433","v":0},null,null,24,0,0,0,0,0,0,0,0,0,0,0,"ok","ok",0,0,{"$f":"Wniosek!F58","v":"00:00:00"},{"$f":"Wniosek!G58","v":"00:00:00"},{"$f":"Wniosek!H58","v":""}]
[{"$f":"Wniosek!A192","v":25},{"$f":"Wniosek!B434","v":""},{"$f":"Wniosek!C434","v":0},{"$f":"ROUND(Wniosek!E434,2)","v":0},{"$f":"Wniosek!D434","v":0},{"$f":"Wniosek!F434","v":0},{"$f":"Wniosek!G434","v":0},{"$f":"Wniosek!H434","v":0},{"$f":"Wniosek!I434","v":0},null,null,25,0,0,0,0,0,0,0,0,0,0,0,"ok","ok",0,0,{"$f":"Wniosek!F59","v":"00:00:00"},{"$f":"Wniosek!G59","v":"00:00:00"},{"$f":"Wniosek!H59","v":""}]
[{"$f":"Wniosek!A193","v":26},{"$f":"Wniosek!B435","v":""},{"$f":"Wniosek!C435","v":0},{"$f":"ROUND(Wniosek!E435,2)","v":0},{"$f":"Wniosek!D435","v":0},{"$f":"Wniosek!F435","v":0},{"$f":"Wniosek!G435","v":0},{"$f":"Wniosek!H435","v":0},{"$f":"Wniosek!I435","v":0},null,null,26,0,0,0,0,0,0,0,0,0,0,0,"ok","ok",0,0,{"$f":"Wniosek!F60","v":"00:00:00"},{"$f":"Wniosek!G60","v":"00:00:00"},{"$f":"Wniosek!H60","v":""}]
[{"$f":"Wniosek!A194","v":27},{"$f":"Wniosek!B436","v":""},{"$f":"Wniosek!C436","v":0},{"$f":"ROUND(Wniosek!E436,2)","v":0},{"$f":"Wniosek!D436","v":0},{"$f":"Wniosek!F436","v":0},{"$f":"Wniosek!G436","v":0},{"$f":"Wniosek!H436","v":0},{"$f":"Wniosek!I436","v":0},null,null,27,0,0,0,0,0,0,0,0,0,0,0,"ok","ok",0,0,{"$f":"Wniosek!F61","v":"00:00:00"},{"$f":"Wniosek!G61","v":"00:00:00"},{"$f":"Wniosek!H61","v":""}]
[{"$f":"Wniosek!A195","v":28},{"$f":"Wniosek!B437","v":""},{"$f":"Wniosek!C437","v":0},{"$f":"ROUND(Wniosek!E437,2)","v":0},{"$f":"Wniosek!D437","v":0},{"$f":"Wniosek!F437","v":0},{"$f":"Wniosek!G437","v":0},{"$f":"Wniosek!H437","v":0},{"$f":"Wniosek!I437","v":0},null,null,28,0,0,0,0,0,0,0,0,0,0,0,"ok","ok",0,0,{"$f":"Wniosek!F62","v":"00:00:00"},{"$f":"Wniosek!G62","v":"00:00:00"},{"$f":"Wniosek!H62","v":""}]
[{"$f":"Wniosek!A196","v":29},{"$f":"Wniosek!B438","v":""},{"$f":"Wniosek!C438","v":0},{"$f":"ROUND(Wniosek!E438,2)","v":0},{"$f":"Wniosek!D438","v":0},{"$f":"Wniosek!F438","v":0},{"$f":"Wniosek!G438","v":0},{"$f":"Wniosek!H438","v":0},{"$f":"Wniosek!I438","v":0},null,null,29,0,0,0,0,0,0,0,0,0,0,0,"ok","ok",0,0,{"$f":"Wniosek!F63","v":"00:00:00"},{"$f":"Wniosek!G63","v":"00:00:00"},{"$f":"Wniosek!H63","v":""}]
[{"$f":"Wniosek!A197","v":30},{"$f":"Wniosek!B439","v":""},{"$f":"Wniosek!C439","v":0},{"$f":"ROUND(Wniosek!E439,2)","v":0},{"$f":"Wniosek!D439","v":0},{"$f":"Wniosek!F439","v":0},{"$f":"Wniosek!G439","v":0},{"$f":"Wniosek!H439","v":0},{"$f":"Wniosek!I439","v":0},null,null,30,0,0,0,0,0,0,0,0,0,0,0,"ok","ok",0,0,{"$f":"Wniosek!F64","v":"00:00:00"},{"$f":"Wniosek!G64","v":"00:00:00"},{"$f":"Wniosek!H64","v":""}]
[{"$f":"Wniosek!A198","v":31},{"$f":"Wniosek!B440","v":""},{"$f":"Wniosek!C440","v":0},{"$f":"ROUND(Wniosek!E440,2)","v":0},{"$f":"Wniosek!D440","v":0},{"$f":"Wniosek!F440","v":0},{"$f":"Wniosek!G440","v":0},{"$f":"Wniosek!H440","v":0},{"$f":"Wniosek!I440","v":0},null,null,31,0,0,0,0,0,0,0,0,0,0,0,"ok","ok",0,0,{"$f":"Wniosek!F65","v":"00:00:00"},{"$f":"Wniosek!G65","v":"00:00:00"},{"$f":"Wniosek!H65","v":""}]
[{"$f":"Wniosek!A199","v":32},{"$f":"Wniosek!B441","v":""},{"$f":"Wniosek!C441","v":0},{"$f":"ROUND(Wniosek!E441,2)","v":0},{"$f":"Wniosek!D441","v":0},{"$f":"Wniosek!F441","v":0},{"$f":"Wniosek!G441","v":0},{"$f":"Wniosek!H441","v":0},{"$f":"Wniosek!I441","v":0},null,null,32,0,0,0,0,0,0,0,0,0,0,0,"ok","ok",0,0,{"$f":"Wniosek!F66","v":"00:00:00"},{"$f":"Wniosek!G66","v":"00:00:00"},{"$f":"Wniosek!H66","v":""}]
[{"$f":"Wniosek!A200","v":33},{"$f":"Wniosek!B442","v":""},{"$f":"Wniosek!C442","v":0},{"$f":"ROUND(Wniosek!E442,2)","v":0},{"$f":"Wniosek!D442","v":0},{"$f":"Wniosek!F442","v":0},{"$f":"Wniosek!G442","v":0},{"$f":"Wniosek!H442","v":0},{"$f":"Wniosek!I442","v":0},null,null,33,0,0,0,0,0,0,0,0,0,0,0,"ok","ok",0,0,{"$f":"Wniosek!F67","v":"00:00:00"},{"$f":"Wniosek!G67","v":"00:00:00"},{"$f":"Wniosek!H67","v":""}]
[{"$f":"Wniosek!A201","v":34},{"$f":"Wniosek!B443","v":""},{"$f":"Wniosek!C443","v":0},{"$f":"ROUND(Wniosek!E443,2)","v":0},{"$f":"Wniosek!D443","v":0},{"$f":"Wniosek!F443","v":0},{"$f":"Wniosek!G443","v":0},{"$f":"Wniosek!H443","v":0},{"$f":"Wniosek!I443","v":0},null,null,34,0,0,0,0,0,0,0,0,0,0,0,"ok","ok",0,0,{"$f":"Wniosek!F68","v":"00:00:00"},{"$f":"Wniosek!G68","v":"00:00:00"},{"$f":"Wniosek!H68","v":""}]
[{"$f":"Wniosek!A202","v":35},{"$f":"Wniosek!B444","v":""},{"$f":"Wniosek!C444","v":0},{"$f":"ROUND(Wniosek!E444,2)","v":0},{"$f":"Wniosek!D444","v":0},{"$f":"Wniosek!F444","v":0},{"$f":"Wniosek!G444","v":0},{"$f":"Wniosek!H444","v":0},{"$f":"Wniosek!I444","v":0},null,null,35,0,0,0,0,0,0,0,0,0,0,0,"ok","ok",0,0,{"$f":"Wniosek!F69","v":"00:00:00"},{"$f":"Wniosek!G69","v":"00:00:00"},{"$f":"Wniosek!H69","v":""}]
[{"$f":"Wniosek!A203","v":36},{"$f":"Wniosek!B445","v":""},{"$f":"Wniosek!C445","v":0},{"$f":"ROUND(Wniosek!E445,2)","v":0},{"$f":"Wniosek!D445","v":0},{"$f":"Wniosek!F445","v":0},{"$f":"Wniosek!G445","v":0},{"$f":"Wniosek!H445","v":0},{"$f":"Wniosek!I445","v":0},null,null,36,0,0,0,0,0,0,0,0,0,0,0,"ok","ok",0,0,{"$f":"Wniosek!F70","v":"00:00:00"},{"$f":"Wniosek!G70","v":"00:00:00"},{"$f":"Wniosek!H70","v":""}]
[{"$f":"Wniosek!A204","v":37},{"$f":"Wniosek!B446","v":""},{"$f":"Wniosek!C446","v":0},{"$f":"ROUND(Wniosek!E446,2)","v":0},{"$f":"Wniosek!D446","v":0},{"$f":"Wniosek!F446","v":0},{"$f":"Wniosek!G446","v":0},{"$f":"Wniosek!H446","v":0},{"$f":"Wniosek!I446","v":0},null,null,37,0,0,0,0,0,0,0,0,0,0,0,"ok","ok",0,0,{"$f":"Wniosek!F71","v":"00:00:00"},{"$f":"Wniosek!G71","v":"00:00:00"},{"$f":"Wniosek!H71","v":""}]
[{"$f":"Wniosek!A205","v":38},{"$f":"Wniosek!B447","v":""},{"$f":"Wniosek!C447","v":0},{"$f":"ROUND(Wniosek!E447,2)","v":0},{"$f":"Wniosek!D447","v":0},{"$f":"Wniosek!F447","v":0},{"$f":"Wniosek!G447","v":0},{"$f":"Wniosek!H447","v":0},{"$f":"Wniosek!I447","v":0},null,null,38,0,0,0,0,0,0,0,0,0,0,0,"ok","ok",0,0,{"$f":"Wniosek!F72","v":"00:00:00"},{"$f":"Wniosek!G72","v":"00:00:00"},{"$f":"Wniosek!H72","v":""}]
[{"$f":"Wniosek!A206","v":39},{"$f":"Wniosek!B448","v":""},{"$f":"Wniosek!C448","v":0},{"$f":"ROUND(Wniosek!E448,2)","v":0},{"$f":"Wniosek!D448","v":0},{"$f":"Wniosek!F448","v":0},{"$f":"Wniosek!G448","v":0},{"$f":"Wniosek!H448","v":0},{"$f":"Wniosek!I448","v":0},null,null,39,0,0,0,0,0,0,0,0,0,0,0,"ok","ok",0,0,{"$f":"Wniosek!F73","v":"00:00:00"},{"$f":"Wniosek!G73","v":"00:00:00"},{"$f":"Wniosek!H73","v":""}]
[{"$f":"Wniosek!A207","v":40},{"$f":"Wniosek!B449","v":""},{"$f":"Wniosek!C449","v":0},{"$f":"ROUND(Wniosek!E449,2)","v":0},{"$f":"Wniosek!D449","v":0},{"$f":"Wniosek!F449","v":0},{"$f":"Wniosek!G449","v":0},{"$f":"Wniosek!H449","v":0},{"$f":"Wniosek!I449","v":0},null,null,40,0,0,0,0,0,0,0,0,0,0,0,"ok","ok",0,0,{"$f":"Wniosek!F74","v":"00:00:00"},{"$f":"Wniosek!G74","v":"00:00:00"},{"$f":"Wniosek!H74","v":""}]
[{"$f":"Wniosek!A208","v":41},{"$f":"Wniosek!B450","v":""},{"$f":"Wniosek!C450","v":0},{"$f":"ROUND(Wniosek!E450,2)","v":0},{"$f":"Wniosek!D450","v":0},{"$f":"Wniosek!F450","v":0},{"$f":"Wniosek!G450","v":0},{"$f":"Wniosek!H450","v":0},{"$f":"Wniosek!I450","v":0},null,null,41,0,0,0,0,0,0,0,0,0,0,0,"ok","ok",0,0,{"$f":"Wniosek!F75","v":"00:00:00"},{"$f":"Wniosek!G75","v":"00:00:00"},{"$f":"Wniosek!H75","v":""}]
[{"$f":"Wniosek!A209","v":42},{"$f":"Wniosek!B451","v":""},{"$f":"Wniosek!C451","v":0},{"$f":"ROUND(Wniosek!E451,2)","v":0},{"$f":"Wniosek!D451","v":0},{"$f":"Wniosek!F451","v":0},{"$f":"Wniosek!G451","v":0},{"$f":"Wniosek!H451","v":0},{"$f":"Wniosek!I451","v":0},null,null,42,0,0,0,0,0,0,0,0,0,0,0,"ok","ok",0,0,{"$f":"Wniosek!F76","v":"00:00:00"},{"$f":"Wniosek!G76","v":"00:00:00"},{"$f":"Wniosek!H76","v":""}]
[{"$f":"Wniosek!A210","v":43},{"$f":"Wniosek!B452","v":""},{"$f":"Wniosek!C452","v":0},{"$f":"ROUND(Wniosek!E452,2)","v":0},{"$f":"Wniosek!D452","v":0},{"$f":"Wniosek!F452","v":0},{"$f":"Wniosek!G452","v":0},{"$f":"Wniosek!H452","v":0},{"$f":"Wniosek!I452","v":0},null,null,43,0,0,0,0,0,0,0,0,0,0,0,"ok","ok",0,0,{"$f":"Wniosek!F77","v":"00:00:00"},{"$f":"Wniosek!G77","v":"00:00:00"},{"$f":"Wniosek!H77","v":""}]
[{"$f":"Wniosek!A211","v":44},{"$f":"Wniosek!B453","v":""},{"$f":"Wniosek!C453","v":0},{"$f":"ROUND(Wniosek!E453,2)","v":0},{"$f":"Wniosek!D453","v":0},{"$f":"Wniosek!F453","v":0},{"$f":"Wniosek!G453","v":0},{"$f":"Wniosek!H453","v":0},{"$f":"Wniosek!I453","v":0},null,null,44,0,0,0,0,0,0,0,0,0,0,0,"ok","ok",0,0,{"$f":"Wniosek!F78","v":"00:00:00"},{"$f":"Wniosek!G78","v":"00:00:00"},{"$f":"Wniosek!H78","v":""}]
[{"$f":"Wniosek!A212","v":45},{"$f":"Wniosek!B454","v":""},{"$f":"Wniosek!C454","v":0},{"$f":"ROUND(Wniosek!E454,2)","v":0},{"$f":"Wniosek!D454","v":0},{"$f":"Wniosek!F454","v":0},{"$f":"Wniosek!G454","v":0},{"$f":"Wniosek!H454","v":0},{"$f":"Wniosek!I454","v":0},null,null,45,0,0,0,0,0,0,0,0,0,0,0,"ok","ok",0,0,{"$f":"Wniosek!F79","v":"00:00:00"},{"$f":"Wniosek!G79","v":"00:00:00"},{"$f":"Wniosek!H79","v":""}]
[{"$f":"Wniosek!A213","v":46},{"$f":"Wniosek!B455","v":""},{"$f":"Wniosek!C455","v":0},{"$f":"ROUND(Wniosek!E455,2)","v":0},{"$f":"Wniosek!D455","v":0},{"$f":"Wniosek!F455","v":0},{"$f":"Wniosek!G455","v":0},{"$f":"Wniosek!H455","v":0},{"$f":"Wniosek!I455","v":0},null,null,46,0,0,0,0,0,0,0,0,0,0,0,"ok","ok",0,0,{"$f":"Wniosek!F80","v":"00:00:00"},{"$f":"Wniosek!G80","v":"00:00:00"},{"$f":"Wniosek!H80","v":""}]
[{"$f":"Wniosek!A214","v":47},{"$f":"Wniosek!B456","v":""},{"$f":"Wniosek!C456","v":0},{"$f":"ROUND(Wniosek!E456,2)","v":0},{"$f":"Wniosek!D456","v":0},{"$f":"Wniosek!F456","v":0},{"$f":"Wniosek!G456","v":0},{"$f":"Wniosek!H456","v":0},{"$f":"Wniosek!I456","v":0},null,null,47,0,0,0,0,0,0,0,0,0,0,0,"ok","ok",0,0,{"$f":"Wniosek!F81","v":"00:00:00"},{"$f":"Wniosek!G81","v":"00:00:00"},{"$f":"Wniosek!H81","v":""}]
[{"$f":"Wniosek!A215","v":48},{"$f":"Wniosek!B457","v":""},{"$f":"Wniosek!C457","v":0},{"$f":"ROUND(Wniosek!E457,2)","v":0},{"$f":"Wniosek!D457","v":0},{"$f":"Wniosek!F457","v":0},{"$f":"Wniosek!G457","v":0},{"$f":"Wniosek!H457","v":0},{"$f":"Wniosek!I457","v":0},null,null,48,0,0,0,0,0,0,0,0,0,0,0,"ok","ok",0,0,{"$f":"Wniosek!F82","v":"00:00:00"},{"$f":"Wniosek!G82","v":"00:00:00"},{"$f":"Wniosek!H82","v":""}]
[{"$f":"Wniosek!A216","v":49},{"$f":"Wniosek!B458","v":""},{"$f":"Wniosek!C458","v":0},{"$f":"ROUND(Wniosek!E458,2)","v":0},{"$f":"Wniosek!D458","v":0},{"$f":"Wniosek!F458","v":0},{"$f":"Wniosek!G458","v":0},{"$f":"Wniosek!H458","v":0},{"$f":"Wniosek!I458","v":0},null,null,49,0,0,0,0,0,0,0,0,0,0,0,"ok","ok",0,0,{"$f":"Wniosek!F83","v":"00:00:00"},{"$f":"Wniosek!G83","v":"00:00:00"},{"$f":"Wniosek!H83","v":""}]
[{"$f":"Wniosek!A217","v":50},{"$f":"Wniosek!B459","v":""},{"$f":"Wniosek!C459","v":0},{"$f":"ROUND(Wniosek!E459,2)","v":0},{"$f":"Wniosek!D459","v":0},{"$f":"Wniosek!F459","v":0},{"$f":"Wniosek!G459","v":0},{"$f":"Wniosek!H459","v":0},{"$f":"Wniosek!I459","v":0},null,null,50,0,0,0,0,0,0,0,0,0,0,0,"ok","ok",0,0,{"$f":"Wniosek!F84","v":"00:00:00"},{"$f":"Wniosek!G84","v":"00:00:00"},{"$f":"Wniosek!H84","v":""}]
[{"$f":"Wniosek!A218","v":51},{"$f":"Wniosek!B460","v":""},{"$f":"Wniosek!C460","v":0},{"$f":"ROUND(Wniosek!E460,2)","v":0},{"$f":"Wniosek!D460","v":0},{"$f":"Wniosek!F460","v":0},{"$f":"Wniosek!G460","v":0},{"$f":"Wniosek!H460","v":0},{"$f":"Wniosek!I460","v":0},null,null,51,0,0,0,0,0,0,0,0,0,0,0,"ok","ok",0,0,{"$f":"Wniosek!F85","v":"00:00:00"},{"$f":"Wniosek!G85","v":"00:00:00"},{"$f":"Wniosek!H85","v":""}]
[{"$f":"Wniosek!A219","v":52},{"$f":"Wniosek!B461","v":""},{"$f":"Wniosek!C461","v":0},{"$f":"ROUND(Wniosek!E461,2)","v":0},{"$f":"Wniosek!D461","v":0},{"$f":"Wniosek!F461","v":0},{"$f":"Wniosek!G461","v":0},{"$f":"Wniosek!H461","v":0},{"$f":"Wniosek!I461","v":0},null,null,52,0,0,0,0,0,0,0,0,0,0,0,"ok","ok",0,0,{"$f":"Wniosek!F86","v":"00:00:00"},{"$f":"Wniosek!G86","v":"00:00:00"},{"$f":"Wniosek!H86","v":""}]
[{"$f":"Wniosek!A220","v":53},{"$f":"Wniosek!B462","v":""},{"$f":"Wniosek!C462","v":0},{"$f":"ROUND(Wniosek!E462,2)","v":0},{"$f":"Wniosek!D462","v":0},{"$f":"Wniosek!F462","v":0},{"$f":"Wniosek!G462","v":0},{"$f":"Wniosek!H462","v":0},{"$f":"Wniosek!I462","v":0},null,null,53,0,0,0,0,0,0,0,0,0,0,0,"ok","ok",0,0,{"$f":"Wniosek!F87","v":"00:00:00"},{"$f":"Wniosek!G87","v":"00:00:00"},{"$f":"Wniosek!H87","v":""}]
[{"$f":"Wniosek!A221","v":54},{"$f":"Wniosek!B463","v":""},{"$f":"Wniosek!C463","v":0},{"$f":"ROUND(Wniosek!E463,2)","v":0},{"$f":"Wniosek!D463","v":0},{"$f":"Wniosek!F463","v":0},{"$f":"Wniosek!G463","v":0},{"$f":"Wniosek!H463","v":0},{"$f":"Wniosek!I463","v":0},null,null,54,0,0,0,0,0,0,0,0,0,0,0,"ok","ok",0,0,{"$f":"Wniosek!F88","v":"00:00:00"},{"$f":"Wniosek!G88","v":"00:00:00"},{"$f":"Wniosek!H88","v":""}]
[{"$f":"Wniosek!A222","v":55},{"$f":"Wniosek!B464","v":""},{"$f":"Wniosek!C464","v":0},{"$f":"ROUND(Wniosek!E464,2)","v":0},{"$f":"Wniosek!D464","v":0},{"$f":"Wniosek!F464","v":0},{"$f":"Wniosek!G464","v":0},{"$f":"Wniosek!H464","v":0},{"$f":"Wniosek!I464","v":0},null,null,55,0,0,0,0,0,0,0,0,0,0,0,"ok","ok",0,0,{"$f":"Wniosek!F89","v":"00:00:00"},{"$f":"Wniosek!G89","v":"00:00:00"},{"$f":"Wniosek!H89","v":""}]
[{"$f":"Wniosek!A223","v":56},{"$f":"Wniosek!B465","v":""},{"$f":"Wniosek!C465","v":0},{"$f":"ROUND(Wniosek!E465,2)","v":0},{"$f":"Wniosek!D465","v":0},{"$f":"Wniosek!F465","v":0},{"$f":"Wniosek!G465","v":0},{"$f":"Wniosek!H465","v":0},{"$f":"Wniosek!I465","v":0},null,null,56,0,0,0,0,0,0,0,0,0,0,0,"ok","ok",0,0,{"$f":"Wniosek!F90","v":"00:00:00"},{"$f":"Wniosek!G90","v":"00:00:00"},{"$f":"Wniosek!H90","v":""}]
[{"$f":"Wniosek!A224","v":57},{"$f":"Wniosek!B466","v":""},{"$f":"Wniosek!C466","v":0},{"$f":"ROUND(Wniosek!E466,2)","v":0},{"$f":"Wniosek!D466","v":0},{"$f":"Wniosek!F466","v":0},{"$f":"Wniosek!G466","v":0},{"$f":"Wniosek!H466","v":0},{"$f":"Wniosek!I466","v":0},null,null,57,0,0,0,0,0,0,0,0,0,0,0,"ok","ok",0,0,{"$f":"Wniosek!F91","v":"00:00:00"},{"$f":"Wniosek!G91","v":"00:00:00"},{"$f":"Wniosek!H91","v":""}]
[{"$f":"Wniosek!A225","v":58},{"$f":"Wniosek!B467","v":""},{"$f":"Wniosek!C467","v":0},{"$f":"ROUND(Wniosek!E467,2)","v":0},{"$f":"Wniosek!D467","v":0},{"$f":"Wniosek!F467","v":0},{"$f":"Wniosek!G467","v":0},{"$f":"Wniosek!H467","v":0},{"$f":"Wniosek!I467","v":0},null,null,58,0,0,0,0,0,0,0,0,0,0,0,"ok","ok",0,0,{"$f":"Wniosek!F92","v":"00:00:00"},{"$f":"Wniosek!G92","v":"00:00:00"},{"$f":"Wniosek!H92","v":""}]
[{"$f":"Wniosek!A226","v":59},{"$f":"Wniosek!B468","v":""},{"$f":"Wniosek!C468","v":0},{"$f":"ROUND(Wniosek!E468,2)","v":0},{"$f":"Wniosek!D468","v":0},{"$f":"Wniosek!F468","v":0},{"$f":"Wniosek!G468","v":0},{"$f":"Wniosek!H468","v":0},{"$f":"Wniosek!I468","v":0},null,null,59,0,0,0,0,0,0,0,0,0,0,0,"ok","ok",0,0,{"$f":"Wniosek!F93","v":"00:00:00"},{"$f":"Wniosek!G93","v":"00:00:00"},{"$f":"Wniosek!H93","v":""}]
[{"$f":"Wniosek!A227","v":60},{"$f":"Wniosek!B469","v":""},{"$f":"Wniosek!C469","v":0},{"$f":"ROUND(Wniosek!E469,2)","v":0},{"$f":"Wniosek!D469","v":0},{"$f":"Wniosek!F469","v":0},{"$f":"Wniosek!G469","v":0},{"$f":"Wniosek!H469","v":0},{"$f":"Wniosek!I469","v":0},null,null,60,0,0,0,0,0,0,0,0,0,0,0,"ok","ok",0,0,{"$f":"Wniosek!F94","v":"00:00:00"},{"$f":"Wniosek!G94","v":"00:00:00"},{"$f":"Wniosek!H94","v":""}]
[{"$f":"Wniosek!A228","v":61},{"$f":"Wniosek!B470","v":""},{"$f":"Wniosek!C470","v":0},{"$f":"ROUND(Wniosek!E470,2)","v":0},{"$f":"Wniosek!D470","v":0},{"$f":"Wniosek!F470","v":0},{"$f":"Wniosek!G470","v":0},{"$f":"Wniosek!H470","v":0},{"$f":"Wniosek!I470","v":0},null,null,61,0,0,0,0,0,0,0,0,0,0,0,"ok","ok",0,0,{"$f":"Wniosek!F95","v":"00:00:00"},{"$f":"Wniosek!G95","v":"00:00:00"},{"$f":"Wniosek!H95","v":""}]
[{"$f":"Wniosek!A229","v":62},{"$f":"Wniosek!B471","v":""},{"$f":"Wniosek!C471","v":0},{"$f":"ROUND(Wniosek!E471,2)","v":0},{"$f":"Wniosek!D471","v":0},{"$f":"Wniosek!F471","v":0},{"$f":"Wniosek!G471","v":0},{"$f":"Wniosek!H471","v":0},{"$f":"Wniosek!I471","v":0},null,null,62,0,0,0,0,0,0,0,0,0,0,0,"ok","ok",0,0,{"$f":"Wniosek!F96","v":"00:00:00"},{"$f":"Wniosek!G96","v":"00:00:00"},{"$f":"Wniosek!H96","v":""}]
[{"$f":"Wniosek!A230","v":63},{"$f":"Wniosek!B472","v":""},{"$f":"Wniosek!C472","v":0},{"$f":"ROUND(Wniosek!E472,2)","v":0},{"$f":"Wniosek!D472","v":0},{"$f":"Wniosek!F472","v":0},{"$f":"Wniosek!G472","v":0},{"$f":"Wniosek!H472","v":0},{"$f":"Wniosek!I472","v":0},null,null,63,0,0,0,0,0,0,0,0,0,0,0,"ok","ok",0,0,{"$f":"Wniosek!F97","v":"00:00:00"},{"$f":"Wniosek!G97","v":"00:00:00"},{"$f":"Wniosek!H97","v":""}]
[{"$f":"Wniosek!A231","v":64},{"$f":"Wniosek!B473","v":""},{"$f":"Wniosek!C473","v":0},{"$f":"ROUND(Wniosek!E473,2)","v":0},{"$f":"Wniosek!D473","v":0},{"$f":"Wniosek!F473","v":0},{"$f":"Wniosek!G473","v":0},{"$f":"Wniosek!H473","v":0},{"$f":"Wniosek!I473","v":0},null,null,64,0,0,0,0,0,0,0,0,0,0,0,"ok","ok",0,0,{"$f":"Wniosek!F98","v":"00:00:00"},{"$f":"Wniosek!G98","v":"00:00:00"},{"$f":"Wniosek!H98","v":""}]
[{"$f":"Wniosek!A232","v":65},{"$f":"Wniosek!B474","v":""},{"$f":"Wniosek!C474","v":0},{"$f":"ROUND(Wniosek!E474,2)","v":0},{"$f":"Wniosek!D474","v":0},{"$f":"Wniosek!F474","v":0},{"$f":"Wniosek!G474","v":0},{"$f":"Wniosek!H474","v":0},{"$f":"Wniosek!I474","v":0},null,null,65,0,0,0,0,0,0,0,0,0,0,0,"ok","ok",0,0,{"$f":"Wniosek!F99","v":"00:00:00"},{"$f":"Wniosek!G99","v":"00:00:00"},{"$f":"Wniosek!H99","v":""}]
[{"$f":"Wniosek!A233","v":66},{"$f":"Wniosek!B475","v":""},{"$f":"Wniosek!C475","v":0},{"$f":"ROUND(Wniosek!E475,2)","v":0},{"$f":"Wniosek!D475","v":0},{"$f":"Wniosek!F475","v":0},{"$f":"Wniosek!G475","v":0},{"$f":"Wniosek!H475","v":0},{"$f":"Wniosek!I475","v":0},null,null,{"$f":"A68","v":66},{"$f":"IFERROR(D68/C68,0)","v":0},{"$f":"F68","v":0},{"$f":"IFERROR(N68/M68,0)","v":0},{"$f":"ROUND(N68*C68,2)","v":0},{"$f":"E68*C68","v":0},{"$f":"IFERROR(ROUND(T68*C68,2),0)","v":0},{"$f":"ROUND(T68*C68,2)","v":0},{"$f":"IFERROR(IF((D68-H68)/C68>=$J$3,$J$3,(D68-H68)/C68),0)","v":0},{"$f":"IFERROR(ROUND(I68/C68,2),0)","v":0},{"$f":"D68*0.1","v":0},{"$f":"M68*0.1","v":0},{"$f":"IF(N68>=W68,$K$1,$K$2)","v":"ok"},{"$f":"IF(U68<=$J$3,$K$1,$K$2)","v":"ok"},{"$f":"(R68+P68)-D68","v":0},{"$f":"ROUND(D68-Q68,2)","v":0},{"$f":"Wniosek!F100","v":"00:00:00"},{"$f":"Wniosek!G100","v":"00:00:00"},{"$f":"Wniosek!H100","v":""}]
[{"$f":"Wniosek!A234","v":67},{"$f":"Wniosek!B476","v":""},{"$f":"Wniosek!C476","v":0},{"$f":"ROUND(Wniosek!E476,2)","v":0},{"$f":"Wniosek!D476","v":0},{"$f":"Wniosek!F476","v":0},{"$f":"Wniosek!G476","v":0},{"$f":"Wniosek!H476","v":0},{"$f":"Wniosek!I476","v":0},null,null,67,0,0,0,0,0,0,0,0,0,0,0,"ok","ok",0,0,{"$f":"Wniosek!F101","v":"00:00:00"},{"$f":"Wniosek!G101","v":"00:00:00"},{"$f":"Wniosek!H101","v":""}]
[{"$f":"Wniosek!A235","v":68},{"$f":"Wniosek!B477","v":""},{"$f":"Wniosek!C477","v":0},{"$f":"ROUND(Wniosek!E477,2)","v":0},{"$f":"Wniosek!D477","v":0},{"$f":"Wniosek!F477","v":0},{"$f":"Wniosek!G477","v":0},{"$f":"Wniosek!H477","v":0},{"$f":"Wniosek!I477","v":0},null,null,68,0,0,0,0,0,0,0,0,0,0,0,"ok","ok",0,0,{"$f":"Wniosek!F102","v":"00:00:00"},{"$f":"Wniosek!G102","v":"00:00:00"},{"$f":"Wniosek!H102","v":""}]
[{"$f":"Wniosek!A236","v":69},{"$f":"Wniosek!B478","v":""},{"$f":"Wniosek!C478","v":0},{"$f":"ROUND(Wniosek!E478,2)","v":0},{"$f":"Wniosek!D478","v":0},{"$f":"Wniosek!F478","v":0},{"$f":"Wniosek!G478","v":0},{"$f":"Wniosek!H478","v":0},{"$f":"Wniosek!I478","v":0},null,null,69,0,0,0,0,0,0,0,0,0,0,0,"ok","ok",0,0,{"$f":"Wniosek!F103","v":"00:00:00"},{"$f":"Wniosek!G103","v":"00:00:00"},{"$f":"Wniosek!H103","v":""}]
[{"$f":"Wniosek!A237","v":70},{"$f":"Wniosek!B479","v":""},{"$f":"Wniosek!C479","v":0},{"$f":"ROUND(Wniosek!E479,2)","v":0},{"$f":"Wniosek!D479","v":0},{"$f":"Wniosek!F479","v":0},{"$f":"Wniosek!G479","v":0},{"$f":"Wniosek!H479","v":0},{"$f":"Wniosek!I479","v":0},null,null,70,0,0,0,0,0,0,0,0,0,0,0,"ok","ok",0,0,{"$f":"Wniosek!F104","v":"00:00:00"},{"$f":"Wniosek!G104","v":"00:00:00"},{"$f":"Wniosek!H104","v":""}]
[{"$f":"Wniosek!A238","v":71},{"$f":"Wniosek!B480","v":""},{"$f":"Wniosek!C480","v":0},{"$f":"ROUND(Wniosek!E480,2)","v":0},{"$f":"Wniosek!D480","v":0},{"$f":"Wniosek!F480","v":0},{"$f":"Wniosek!G480","v":0},{"$f":"Wniosek!H480","v":0},{"$f":"Wniosek!I480","v":0},null,null,71,0,0,0,0,0,0,0,0,0,0,0,"ok","ok",0,0,{"$f":"Wniosek!F105","v":"00:00:00"},{"$f":"Wniosek!G105","v":"00:00:00"},{"$f":"Wniosek!H105","v":""}]
[{"$f":"Wniosek!A239","v":72},{"$f":"Wniosek!B481","v":""},{"$f":"Wniosek!C481","v":0},{"$f":"ROUND(Wniosek!E481,2)","v":0},{"$f":"Wniosek!D481","v":0},{"$f":"Wniosek!F481","v":0},{"$f":"Wniosek!G481","v":0},{"$f":"Wniosek!H481","v":0},{"$f":"Wniosek!I481","v":0},null,null,72,0,0,0,0,0,0,0,0,0,0,0,"ok","ok",0,0,{"$f":"Wniosek!F106","v":"00:00:00"},{"$f":"Wniosek!G106","v":"00:00:00"},{"$f":"Wniosek!H106","v":""}]
[{"$f":"Wniosek!A240","v":73},{"$f":"Wniosek!B482","v":""},{"$f":"Wniosek!C482","v":0},{"$f":"ROUND(Wniosek!E482,2)","v":0},{"$f":"Wniosek!D482","v":0},{"$f":"Wniosek!F482","v":0},{"$f":"Wniosek!G482","v":0},{"$f":"Wniosek!H482","v":0},{"$f":"Wniosek!I482","v":0},null,null,73,0,0,0,0,0,0,0,0,0,0,0,"ok","ok",0,0,{"$f":"Wniosek!F107","v":"00:00:00"},{"$f":"Wniosek!G107","v":"00:00:00"},{"$f":"Wniosek!H107","v":""}]
[{"$f":"Wniosek!A241","v":74},{"$f":"Wniosek!B483","v":""},{"$f":"Wniosek!C483","v":0},{"$f":"ROUND(Wniosek!E483,2)","v":0},{"$f":"Wniosek!D483","v":0},{"$f":"Wniosek!F483","v":0},{"$f":"Wniosek!G483","v":0},{"$f":"Wniosek!H483","v":0},{"$f":"Wniosek!I483","v":0},null,null,74,0,0,0,0,0,0,0,0,0,0,0,"ok","ok",0,0,{"$f":"Wniosek!F108","v":"00:00:00"},{"$f":"Wniosek!G108","v":"00:00:00"},{"$f":"Wniosek!H108","v":""}]
[{"$f":"Wniosek!A242","v":75},{"$f":"Wniosek!B484","v":""},{"$f":"Wniosek!C484","v":0},{"$f":"ROUND(Wniosek!E484,2)","v":0},{"$f":"Wniosek!D484","v":0},{"$f":"Wniosek!F484","v":0},{"$f":"Wniosek!G484","v":0},{"$f":"Wniosek!H484","v":0},{"$f":"Wniosek!I484","v":0},null,null,75,0,0,0,0,0,0,0,0,0,0,0,"ok","ok",0,0,{"$f":"Wniosek!F109","v":"00:00:00"},{"$f":"Wniosek!G109","v":"00:00:00"},{"$f":"Wniosek!H109","v":""}]
[{"$f":"Wniosek!A243","v":76},{"$f":"Wniosek!B485","v":""},{"$f":"Wniosek!C485","v":0},{"$f":"ROUND(Wniosek!E485,2)","v":0},{"$f":"Wniosek!D485","v":0},{"$f":"Wniosek!F485","v":0},{"$f":"Wniosek!G485","v":0},{"$f":"Wniosek!H485","v":0},{"$f":"Wniosek!I485","v":0},null,null,76,0,0,0,0,0,0,0,0,0,0,0,"ok","ok",0,0,{"$f":"Wniosek!F110","v":"00:00:00"},{"$f":"Wniosek!G110","v":"00:00:00"},{"$f":"Wniosek!H110","v":""}]
[{"$f":"Wniosek!A244","v":77},{"$f":"Wniosek!B486","v":""},{"$f":"Wniosek!C486","v":0},{"$f":"ROUND(Wniosek!E486,2)","v":0},{"$f":"Wniosek!D486","v":0},{"$f":"Wniosek!F486","v":0},{"$f":"Wniosek!G486","v":0},{"$f":"Wniosek!H486","v":0},{"$f":"Wniosek!I486","v":0},null,null,77,0,0,0,0,0,0,0,0,0,0,0,"ok","ok",0,0,{"$f":"Wniosek!F111","v":"00:00:00"},{"$f":"Wniosek!G111","v":"00:00:00"},{"$f":"Wniosek!H111","v":""}]
[{"$f":"Wniosek!A245","v":78},{"$f":"Wniosek!B487","v":""},{"$f":"Wniosek!C487","v":0},{"$f":"ROUND(Wniosek!E487,2)","v":0},{"$f":"Wniosek!D487","v":0},{"$f":"Wniosek!F487","v":0},{"$f":"Wniosek!G487","v":0},{"$f":"Wniosek!H487","v":0},{"$f":"Wniosek!I487","v":0},null,null,78,0,0,0,0,0,0,0,0,0,0,0,"ok","ok",0,0,{"$f":"Wniosek!F112","v":"00:00:00"},{"$f":"Wniosek!G112","v":"00:00:00"},{"$f":"Wniosek!H112","v":""}]
[{"$f":"Wniosek!A246","v":79},{"$f":"Wniosek!B488","v":""},{"$f":"Wniosek!C488","v":0},{"$f":"ROUND(Wniosek!E488,2)","v":0},{"$f":"Wniosek!D488","v":0},{"$f":"Wniosek!F488","v":0},{"$f":"Wniosek!G488","v":0},{"$f":"Wniosek!H488","v":0},{"$f":"Wniosek!I488","v":0},null,null,79,0,0,0,0,0,0,0,0,0,0,0,"ok","ok",0,0,{"$f":"Wniosek!F113","v":"00:00:00"},{"$f":"Wniosek!G113","v":"00:00:00"},{"$f":"Wniosek!H113","v":""}]
[{"$f":"Wniosek!A247","v":80},{"$f":"Wniosek!B489","v":""},{"$f":"Wniosek!C489","v":0},{"$f":"ROUND(Wniosek!E489,2)","v":0},{"$f":"Wniosek!D489","v":0},{"$f":"Wniosek!F489","v":0},{"$f":"Wniosek!G489","v":0},{"$f":"Wniosek!H489","v":0},{"$f":"Wniosek!I489","v":0},null,null,80,0,0,0,0,0,0,0,0,0,0,0,"ok","ok",0,0,{"$f":"Wniosek!F114","v":"00:00:00"},{"$f":"Wniosek!G114","v":"00:00:00"},{"$f":"Wniosek!H114","v":""}]
[{"$f":"Wniosek!A248","v":81},{"$f":"Wniosek!B490","v":""},{"$f":"Wniosek!C490","v":0},{"$f":"ROUND(Wniosek!E490,2)","v":0},{"$f":"Wniosek!D490","v":0},{"$f":"Wniosek!F490","v":0},{"$f":"Wniosek!G490","v":0},{"$f":"Wniosek!H490","v":0},{"$f":"Wniosek!I490","v":0},null,null,81,0,0,0,0,0,0,0,0,0,0,0,"ok","ok",0,0,{"$f":"Wniosek!F115","v":"00:00:00"},{"$f":"Wniosek!G115","v":"00:00:00"},{"$f":"Wniosek!H115","v":""}]
[{"$f":"Wniosek!A249","v":82},{"$f":"Wniosek!B491","v":""},{"$f":"Wniosek!C491","v":0},{"$f":"ROUND(Wniosek!E491,2)","v":0},{"$f":"Wniosek!D491","v":0},{"$f":"Wniosek!F491","v":0},{"$f":"Wniosek!G491","v":0},{"$f":"Wniosek!H491","v":0},{"$f":"Wniosek!I491","v":0},null,null,82,0,0,0,0,0,0,0,0,0,0,0,"ok","ok",0,0,{"$f":"Wniosek!F116","v":"00:00:00"},{"$f":"Wniosek!G116","v":"00:00:00"},{"$f":"Wniosek!H116","v":""}]
[{"$f":"Wniosek!A250","v":83},{"$f":"Wniosek!B492","v":""},{"$f":"Wniosek!C492","v":0},{"$f":"ROUND(Wniosek!E492,2)","v":0},{"$f":"Wniosek!D492","v":0},{"$f":"Wniosek!F492","v":0},{"$f":"Wniosek!G492","v":0},{"$f":"Wniosek!H492","v":0},{"$f":"Wniosek!I492","v":0},null,null,83,0,0,0,0,0,0,0,0,0,0,0,"ok","ok",0,0,{"$f":"Wniosek!F117","v":"00:00:00"},{"$f":"Wniosek!G117","v":"00:00:00"},{"$f":"Wniosek!H117","v":""}]
[{"$f":"Wniosek!A251","v":84},{"$f":"Wniosek!B493","v":""},{"$f":"Wniosek!C493","v":0},{"$f":"ROUND(Wniosek!E493,2)","v":0},{"$f":"Wniosek!D493","v":0},{"$f":"Wniosek!F493","v":0},{"$f":"Wniosek!G493","v":0},{"$f":"Wniosek!H493","v":0},{"$f":"Wniosek!I493","v":0},null,null,84,0,0,0,0,0,0,0,0,0,0,0,"ok","ok",0,0,{"$f":"Wniosek!F118","v":"00:00:00"},{"$f":"Wniosek!G118","v":"00:00:00"},{"$f":"Wniosek!H118","v":""}]
[{"$f":"Wniosek!A252","v":85},{"$f":"Wniosek!B494","v":""},{"$f":"Wniosek!C494","v":0},{"$f":"ROUND(Wniosek!E494,2)","v":0},{"$f":"Wniosek!D494","v":0},{"$f":"Wniosek!F494","v":0},{"$f":"Wniosek!G494","v":0},{"$f":"Wniosek!H494","v":0},{"$f":"Wniosek!I494","v":0},null,null,85,0,0,0,0,0,0,0,0,0,0,0,"ok","ok",0,0,{"$f":"Wniosek!F119","v":"00:00:00"},{"$f":"Wniosek!G119","v":"00:00:00"},{"$f":"Wniosek!H119","v":""}]
[{"$f":"Wniosek!A253","v":86},{"$f":"Wniosek!B495","v":""},{"$f":"Wniosek!C495","v":0},{"$f":"ROUND(Wniosek!E495,2)","v":0},{"$f":"Wniosek!D495","v":0},{"$f":"Wniosek!F495","v":0},{"$f":"Wniosek!G495","v":0},{"$f":"Wniosek!H495","v":0},{"$f":"Wniosek!I495","v":0},null,null,86,0,0,0,0,0,0,0,0,0,0,0,"ok","ok",0,0,{"$f":"Wniosek!F120","v":"00:00:00"},{"$f":"Wniosek!G120","v":"00:00:00"},{"$f":"Wniosek!H120","v":""}]
[{"$f":"Wniosek!A254","v":87},{"$f":"Wniosek!B496","v":""},{"$f":"Wniosek!C496","v":0},{"$f":"ROUND(Wniosek!E496,2)","v":0},{"$f":"Wniosek!D496","v":0},{"$f":"Wniosek!F496","v":0},{"$f":"Wniosek!G496","v":0},{"$f":"Wniosek!H496","v":0},{"$f":"Wniosek!I496","v":0},null,null,87,0,0,0,0,0,0,0,0,0,0,0,"ok","ok",0,0,{"$f":"Wniosek!F121","v":"00:00:00"},{"$f":"Wniosek!G121","v":"00:00:00"},{"$f":"Wniosek!H121","v":""}]
[{"$f":"Wniosek!A255","v":88},{"$f":"Wniosek!B497","v":""},{"$f":"Wniosek!C497","v":0},{"$f":"ROUND(Wniosek!E497,2)","v":0},{"$f":"Wniosek!D497","v":0},{"$f":"Wniosek!F497","v":0},{"$f":"Wniosek!G497","v":0},{"$f":"Wniosek!H497","v":0},{"$f":"Wniosek!I497","v":0},null,null,88,0,0,0,0,0,0,0,0,0,0,0,"ok","ok",0,0,{"$f":"Wniosek!F122","v":"00:00:00"},{"$f":"Wniosek!G122","v":"00:00:00"},{"$f":"Wniosek!H122","v":""}]
[{"$f":"Wniosek!A256","v":89},{"$f":"Wniosek!B498","v":""},{"$f":"Wniosek!C498","v":0},{"$f":"ROUND(Wniosek!E498,2)","v":0},{"$f":"Wniosek!D498","v":0},{"$f":"Wniosek!F498","v":0},{"$f":"Wniosek!G498","v":0},{"$f":"Wniosek!H498","v":0},{"$f":"Wniosek!I498","v":0},null,null,89,0,0,0,0,0,0,0,0,0,0,0,"ok","ok",0,0,{"$f":"Wniosek!F123","v":"00:00:00"},{"$f":"Wniosek!G123","v":"00:00:00"},{"$f":"Wniosek!H123","v":""}]
[{"$f":"Wniosek!A257","v":90},{"$f":"Wniosek!B499","v":""},{"$f":"Wniosek!C499","v":0},{"$f":"ROUND(Wniosek!E499,2)","v":0},{"$f":"Wniosek!D499","v":0},{"$f":"Wniosek!F499","v":0},{"$f":"Wniosek!G499","v":0},{"$f":"Wniosek!H499","v":0},{"$f":"Wniosek!I499","v":0},null,null,90,0,0,0,0,0,0,0,0,0,0,0,"ok","ok",0,0,{"$f":"Wniosek!F124","v":"00:00:00"},{"$f":"Wniosek!G124","v":"00:00:00"},{"$f":"Wniosek!H124","v":""}]
[{"$f":"Wniosek!A258","v":91},{"$f":"Wniosek!B500","v":""},{"$f":"Wniosek!C500","v":0},{"$f":"ROUND(Wniosek!E500,2)","v":0},{"$f":"Wniosek!D500","v":0},{"$f":"Wniosek!F500","v":0},{"$f":"Wniosek!G500","v":0},{"$f":"Wniosek!H500","v":0},{"$f":"Wniosek!I500","v":0},null,null,91,0,0,0,0,0,0,0,0,0,0,0,"ok","ok",0,0,{"$f":"Wniosek!F125","v":"00:00:00"},{"$f":"Wniosek!G125","v":"00:00:00"},{"$f":"Wniosek!H125","v":""}]
[{"$f":"Wniosek!A259","v":92},{"$f":"Wniosek!B501","v":""},{"$f":"Wniosek!C501","v":0},{"$f":"ROUND(Wniosek!E501,2)","v":0},{"$f":"Wniosek!D501","v":0},{"$f":"Wniosek!F501","v":0},{"$f":"Wniosek!G501","v":0},{"$f":"Wniosek!H501","v":0},{"$f":"Wniosek!I501","v":0},null,null,92,0,0,0,0,0,0,0,0,0,0,0,"ok","ok",0,0,{"$f":"Wniosek!F126","v":"00:00:00"},{"$f":"Wniosek!G126","v":"00:00:00"},{"$f":"Wniosek!H126","v":""}]
[{"$f":"Wniosek!A260","v":93},{"$f":"Wniosek!B502","v":""},{"$f":"Wniosek!C502","v":0},{"$f":"ROUND(Wniosek!E502,2)","v":0},{"$f":"Wniosek!D502","v":0},{"$f":"Wniosek!F502","v":0},{"$f":"Wniosek!G502","v":0},{"$f":"Wniosek!H502","v":0},{"$f":"Wniosek!I502","v":0},null,null,93,0,0,0,0,0,0,0,0,0,0,0,"ok","ok",0,0,{"$f":"Wniosek!F127","v":"00:00:00"},{"$f":"Wniosek!G127","v":"00:00:00"},{"$f":"Wniosek!H127","v":""}]
[{"$f":"Wniosek!A261","v":94},{"$f":"Wniosek!B503","v":""},{"$f":"Wniosek!C503","v":0},{"$f":"ROUND(Wniosek!E503,2)","v":0},{"$f":"Wniosek!D503","v":0},{"$f":"Wniosek!F503","v":0},{"$f":"Wniosek!G503","v":0},{"$f":"Wniosek!H503","v":0},{"$f":"Wniosek!I503","v":0},null,null,94,0,0,0,0,0,0,0,0,0,0,0,"ok","ok",0,0,{"$f":"Wniosek!F128","v":"00:00:00"},{"$f":"Wniosek!G128","v":"00:00:00"},{"$f":"Wniosek!H128","v":""}]
[{"$f":"Wniosek!A262","v":95},{"$f":"Wniosek!B504","v":""},{"$f":"Wniosek!C504","v":0},{"$f":"ROUND(Wniosek!E504,2)","v":0},{"$f":"Wniosek!D504","v":0},{"$f":"Wniosek!F504","v":0},{"$f":"Wniosek!G504","v":0},{"$f":"Wniosek!H504","v":0},{"$f":"Wniosek!I504","v":0},null,null,95,0,0,0,0,0,0,0,0,0,0,0,"ok","ok",0,0,{"$f":"Wniosek!F129","v":"00:00:00"},{"$f":"Wniosek!G129","v":"00:00:00"},{"$f":"Wniosek!H129","v":""}]
[{"$f":"Wniosek!A263","v":96},{"$f":"Wniosek!B505","v":""},{"$f":"Wniosek!C505","v":0},{"$f":"ROUND(Wniosek!E505,2)","v":0},{"$f":"Wniosek!D505","v":0},{"$f":"Wniosek!F505","v":0},{"$f":"Wniosek!G505","v":0},{"$f":"Wniosek!H505","v":0},{"$f":"Wniosek!I505","v":0},null,null,96,0,0,0,0,0,0,0,0,0,0,0,"ok","ok",0,0,{"$f":"Wniosek!F130","v":"00:00:00"},{"$f":"Wniosek!G130","v":"00:00:00"},{"$f":"Wniosek!H130","v":""}]
[{"$f":"Wniosek!A264","v":97},{"$f":"Wniosek!B506","v":""},{"$f":"Wniosek!C506","v":0},{"$f":"ROUND(Wniosek!E506,2)","v":0},{"$f":"Wniosek!D506","v":0},{"$f":"Wniosek!F506","v":0},{"$f":"Wniosek!G506","v":0},{"$f":"Wniosek!H506","v":0},{"$f":"Wniosek!I506","v":0},null,null,97,0,0,0,0,0,0,0,0,0,0,0,"ok","ok",0,0,{"$f":"Wniosek!F131","v":"00:00:00"},{"$f":"Wniosek!G131","v":"00:00:00"},{"$f":"Wniosek!H131","v":""}]
[{"$f":"Wniosek!A265","v":98},{"$f":"Wniosek!B507","v":""},{"$f":"Wniosek!C507","v":0},{"$f":"ROUND(Wniosek!E507,2)","v":0},{"$f":"Wniosek!D507","v":0},{"$f":"Wniosek!F507","v":0},{"$f":"Wniosek!G507","v":0},{"$f":"Wniosek!H507","v":0},{"$f":"Wniosek!I507","v":0},null,null,98,0,0,0,0,0,0,0,0,0,0,0,"ok","ok",0,0,{"$f":"Wniosek!F132","v":"00:00:00"},{"$f":"Wniosek!G132","v":"00:00:00"},{"$f":"Wniosek!H132","v":""}]
[{"$f":"Wniosek!A266","v":99},{"$f":"Wniosek!B508","v":""},{"$f":"Wniosek!C508","v":0},{"$f":"ROUND(Wniosek!E508,2)","v":0},{"$f":"Wniosek!D508","v":0},{"$f":"Wniosek!F508","v":0},{"$f":"Wniosek!G508","v":0},{"$f":"Wniosek!H508","v":0},{"$f":"Wniosek!I508","v":0},null,null,99,0,0,0,0,0,0,0,0,0,0,0,"ok","ok",0,0,{"$f":"Wniosek!F133","v":"00:00:00"},{"$f":"Wniosek!G133","v":"00:00:00"},{"$f":"Wniosek!H133","v":""}]
[{"$f":"Wniosek!A267","v":100},{"$f":"Wniosek!B509","v":""},{"$f":"Wniosek!C509","v":0},{"$f":"ROUND(Wniosek!E509,2)","v":0},{"$f":"Wniosek!D509","v":0},{"$f":"Wniosek!F509","v":0},{"$f":"Wniosek!G509","v":0},{"$f":"Wniosek!H509","v":0},{"$f":"Wniosek!I509","v":0},null,null,100,0,0,0,0,0,0,0,0,0,0,0,"ok","ok",0,0,{"$f":"Wniosek!F134","v":"00:00:00"},{"$f":"Wniosek!G134","v":"00:00:00"},{"$f":"Wniosek!H134","v":""}]
[{"$f":"Wniosek!A268","v":101},{"$f":"Wniosek!B510","v":""},{"$f":"Wniosek!C510","v":0},{"$f":"ROUND(Wniosek!E510,2)","v":0},{"$f":"Wniosek!D510","v":0},{"$f":"Wniosek!F510","v":0},{"$f":"Wniosek!G510","v":0},{"$f":"Wniosek!H510","v":0},{"$f":"Wniosek!I510","v":0},null,null,101,0,0,0,0,0,0,0,0,0,0,0,"ok","ok",0,0,{"$f":"Wniosek!F135","v":"00:00:00"},{"$f":"Wniosek!G135","v":"00:00:00"},{"$f":"Wniosek!H135","v":""}]
[{"$f":"Wniosek!A269","v":102},{"$f":"Wniosek!B511","v":""},{"$f":"Wniosek!C511","v":0},{"$f":"ROUND(Wniosek!E511,2)","v":0},{"$f":"Wniosek!D511","v":0},{"$f":"Wniosek!F511","v":0},{"$f":"Wniosek!G511","v":0},{"$f":"Wniosek!H511","v":0},{"$f":"Wniosek!I511","v":0},null,null,102,0,0,0,0,0,0,0,0,0,0,0,"ok","ok",0,0,{"$f":"Wniosek!F136","v":"00:00:00"},{"$f":"Wniosek!G136","v":"00:00:00"},{"$f":"Wniosek!H136","v":""}]
[{"$f":"Wniosek!A270","v":103},{"$f":"Wniosek!B512","v":""},{"$f":"Wniosek!C512","v":0},{"$f":"ROUND(Wniosek!E512,2)","v":0},{"$f":"Wniosek!D512","v":0},{"$f":"Wniosek!F512","v":0},{"$f":"Wniosek!G512","v":0},{"$f":"Wniosek!H512","v":0},{"$f":"Wniosek!I512","v":0},null,null,103,0,0,0,0,0,0,0,0,0,0,0,"ok","ok",0,0,{"$f":"Wniosek!F137","v":"00:00:00"},{"$f":"Wniosek!G137","v":"00:00:00"},{"$f":"Wniosek!H137","v":""}]
[{"$f":"Wniosek!A271","v":104},{"$f":"Wniosek!B513","v":""},{"$f":"Wniosek!C513","v":0},{"$f":"ROUND(Wniosek!E513,2)","v":0},{"$f":"Wniosek!D513","v":0},{"$f":"Wniosek!F513","v":0},{"$f":"Wniosek!G513","v":0},{"$f":"Wniosek!H513","v":0},{"$f":"Wniosek!I513","v":0},null,null,104,0,0,0,0,0,0,0,0,0,0,0,"ok","ok",0,0,{"$f":"Wniosek!F138","v":"00:00:00"},{"$f":"Wniosek!G138","v":"00:00:00"},{"$f":"Wniosek!H138","v":""}]
[{"$f":"Wniosek!A272","v":105},{"$f":"Wniosek!B514","v":""},{"$f":"Wniosek!C514","v":0},{"$f":"ROUND(Wniosek!E514,2)","v":0},{"$f":"Wniosek!D514","v":0},{"$f":"Wniosek!F514","v":0},{"$f":"Wniosek!G514","v":0},{"$f":"Wniosek!H514","v":0},{"$f":"Wniosek!I514","v":0},null,null,105,0,0,0,0,0,0,0,0,0,0,0,"ok","ok",0,0,{"$f":"Wniosek!F139","v":"00:00:00"},{"$f":"Wniosek!G139","v":"00:00:00"},{"$f":"Wniosek!H139","v":""}]
[{"$f":"Wniosek!A273","v":106},{"$f":"Wniosek!B515","v":""},{"$f":"Wniosek!C515","v":0},{"$f":"ROUND(Wniosek!E515,2)","v":0},{"$f":"Wniosek!D515","v":0},{"$f":"Wniosek!F515","v":0},{"$f":"Wniosek!G515","v":0},{"$f":"Wniosek!H515","v":0},{"$f":"Wniosek!I515","v":0},null,null,106,0,0,0,0,0,0,0,0,0,0,0,"ok","ok",0,0,{"$f":"Wniosek!F140","v":"00:00:00"},{"$f":"Wniosek!G140","v":"00:00:00"}]
[{"$f":"Wniosek!A274","v":107},{"$f":"Wniosek!B516","v":""},{"$f":"Wniosek!C516","v":0},{"$f":"ROUND(Wniosek!E516,2)","v":0},{"$f":"Wniosek!D516","v":0},{"$f":"Wniosek!F516","v":0},{"$f":"Wniosek!G516","v":0},{"$f":"Wniosek!H516","v":0},{"$f":"Wniosek!I516","v":0},null,null,107,0,0,0,0,0,0,0,0,0,0,0,"ok","ok",0,0,{"$f":"Wniosek!F141","v":"00:00:00"},{"$f":"Wniosek!G141","v":"00:00:00"}]
[{"$f":"Wniosek!A275","v":108},{"$f":"Wniosek!B517","v":""},{"$f":"Wniosek!C517","v":0},{"$f":"ROUND(Wniosek!E517,2)","v":0},{"$f":"Wniosek!D517","v":0},{"$f":"Wniosek!F517","v":0},{"$f":"Wniosek!G517","v":0},{"$f":"Wniosek!H517","v":0},{"$f":"Wniosek!I517","v":0},null,null,108,0,0,0,0,0,0,0,0,0,0,0,"ok","ok",0,0,{"$f":"Wniosek!F142","v":"00:00:00"},{"$f":"Wniosek!G142","v":"00:00:00"}]
[{"$f":"Wniosek!A276","v":109},{"$f":"Wniosek!B518","v":""},{"$f":"Wniosek!C518","v":0},{"$f":"ROUND(Wniosek!E518,2)","v":0},{"$f":"Wniosek!D518","v":0},{"$f":"Wniosek!F518","v":0},{"$f":"Wniosek!G518","v":0},{"$f":"Wniosek!H518","v":0},{"$f":"Wniosek!I518","v":0},null,null,109,0,0,0,0,0,0,0,0,0,0,0,"ok","ok",0,0,{"$f":"Wniosek!F143","v":"00:00:00"},{"$f":"Wniosek!G143","v":"00:00:00"}]
[{"$f":"Wniosek!A277","v":110},{"$f":"Wniosek!B519","v":""},{"$f":"Wniosek!C519","v":0},{"$f":"ROUND(Wniosek!E519,2)","v":0},{"$f":"Wniosek!D519","v":0},{"$f":"Wniosek!F519","v":0},{"$f":"Wniosek!G519","v":0},{"$f":"Wniosek!H519","v":0},{"$f":"Wniosek!I519","v":0},null,null,110,0,0,0,0,0,0,0,0,0,0,0,"ok","ok",0,0,{"$f":"Wniosek!F144","v":"00:00:00"},{"$f":"Wniosek!G144","v":"00:00:00"}]
[{"$f":"Wniosek!A278","v":111},{"$f":"Wniosek!B520","v":""},{"$f":"Wniosek!C520","v":0},{"$f":"ROUND(Wniosek!E520,2)","v":0},{"$f":"Wniosek!D520","v":0},{"$f":"Wniosek!F520","v":0},{"$f":"Wniosek!G520","v":0},{"$f":"Wniosek!H520","v":0},{"$f":"Wniosek!I520","v":0},null,null,111,0,0,0,0,0,0,0,0,0,0,0,"ok","ok",0,0,{"$f":"Wniosek!F145","v":"00:00:00"},{"$f":"Wniosek!G145","v":"00:00:00"},{"$f":"Wniosek!H145","v":""}]
[{"$f":"Wniosek!A279","v":112},{"$f":"Wniosek!B521","v":""},{"$f":"Wniosek!C521","v":0},{"$f":"ROUND(Wniosek!E521,2)","v":0},{"$f":"Wniosek!D521","v":0},{"$f":"Wniosek!F521","v":0},{"$f":"Wniosek!G521","v":0},{"$f":"Wniosek!H521","v":0},{"$f":"Wniosek!I521","v":0},null,null,112,0,0,0,0,0,0,0,0,0,0,0,"ok","ok",0,0,{"$f":"Wniosek!F146","v":"00:00:00"},{"$f":"Wniosek!G146","v":"00:00:00"},{"$f":"Wniosek!H146","v":""}]
[{"$f":"Wniosek!A280","v":113},{"$f":"Wniosek!B522","v":""},{"$f":"Wniosek!C522","v":0},{"$f":"ROUND(Wniosek!E522,2)","v":0},{"$f":"Wniosek!D522","v":0},{"$f":"Wniosek!F522","v":0},{"$f":"Wniosek!G522","v":0},{"$f":"Wniosek!H522","v":0},{"$f":"Wniosek!I522","v":0},null,null,113,0,0,0,0,0,0,0,0,0,0,0,"ok","ok",0,0,{"$f":"Wniosek!F147","v":"00:00:00"},{"$f":"Wniosek!G147","v":"00:00:00"},{"$f":"Wniosek!H147","v":""}]
[{"$f":"Wniosek!A281","v":114},{"$f":"Wniosek!B523","v":""},{"$f":"Wniosek!C523","v":0},{"$f":"ROUND(Wniosek!E523,2)","v":0},{"$f":"Wniosek!D523","v":0},{"$f":"Wniosek!F523","v":0},{"$f":"Wniosek!G523","v":0},{"$f":"Wniosek!H523","v":0},{"$f":"Wniosek!I523","v":0},null,null,114,0,0,0,0,0,0,0,0,0,0,0,"ok","ok",0,0,{"$f":"Wniosek!F148","v":"00:00:00"},{"$f":"Wniosek!G148","v":"00:00:00"},{"$f":"Wniosek!H148","v":""}]
[{"$f":"Wniosek!A282","v":115},{"$f":"Wniosek!B524","v":""},{"$f":"Wniosek!C524","v":0},{"$f":"ROUND(Wniosek!E524,2)","v":0},{"$f":"Wniosek!D524","v":0},{"$f":"Wniosek!F524","v":0},{"$f":"Wniosek!G524","v":0},{"$f":"Wniosek!H524","v":0},{"$f":"Wniosek!I524","v":0},null,null,115,0,0,0,0,0,0,0,0,0,0,0,"ok","ok",0,0,{"$f":"Wniosek!F149","v":"00:00:00"},{"$f":"Wniosek!G149","v":"00:00:00"},{"$f":"Wniosek!H149","v":""}]
[{"$f":"Wniosek!A283","v":"Ogółem:"},null,{"$f":"SUM(C3:C117)","v":0},{"$f":"ROUND(Wniosek!E525,2)","v":0},null,null,null,{"$f":"SUM(H3:H117)","v":0},{"$f":"SUMIF(I3:I117,\">0\")","v":0},null,null,null,null,null,null,{"$f":"SUM(P3:P117)","v":0},0,{"$f":"IFERROR(ROUND(T118*C118,2),0)","v":0},0,null,null,{"$f":"D118*0.1","v":0}]

{"sheet":"Operatorzy","index":4,"n_rows":11,"n_cols":8,"rows_kept":11,"cut":false,"hidden":true,"merged":[[0,1,0,4],[0,5,0,6],[0,7,0,8],[1,1,1,4],[1,5,1,6],[1,7,1,8],[2,1,2,4],[2,5,2,6],[2,7,2,8],[3,1,3,4],[3,5,3,6],[3,7,3,8],[4,1,4,4],[4,5,4,6],[4,7,4,8],[5,1,5,4],[5,5,5,6],[5,7,5,8],[6,1,6,4],[6,5,6,6],[6,7,6,8],[7,1,7,4],[7,5,7,6],[7,7,7,8],[10,1,10,4],[10,5,10,6],[10,7,10,8],[8,1,8,4],[8,5,8,6],[8,7,8,8],[9,1,9,4],[9,5,9,6],[9,7,9,8]]}
["Lp.","Nazwa operatora publicznego transportu zbiorowego",null,null,null,"NIP",null,"REGON"]
[{"$f":"Wniosek!A153","v":1},{"$f":"Wniosek!B153","v":0},null,null,null,{"$f":"Wniosek!F153","v":0},null,{"$f":"Wniosek!H153","v":0}]
[{"$f":"Wniosek!A154","v":2},{"$f":"Wniosek!B154","v":0},null,null,null,{"$f":"Wniosek!F154","v":0},null,{"$f":"Wniosek!H154","v":0}]
[{"$f":"Wniosek!A155","v":3},{"$f":"Wniosek!B155","v":0},null,null,null,{"$f":"Wniosek!F155","v":0},null,{"$f":"Wniosek!H155","v":""}]
[{"$f":"Wniosek!A156","v":4},{"$f":"Wniosek!B156","v":0},null,null,null,{"$f":"Wniosek!F156","v":0},null,{"$f":"Wniosek!H156","v":""}]
[{"$f":"Wniosek!A157","v":5},{"$f":"Wniosek!B157","v":0},null,null,null,{"$f":"Wniosek!F157","v":0},null,{"$f":"Wniosek!H157","v":""}]
[{"$f":"Wniosek!A158","v":6},{"$f":"Wniosek!B158","v":""},null,null,null,{"$f":"Wniosek!F158","v":0},null,{"$f":"Wniosek!H158","v":""}]
[{"$f":"Wniosek!A159","v":7},{"$f":"Wniosek!B159","v":""},null,null,null,{"$f":"Wniosek!F159","v":0},null,{"$f":"Wniosek!H159","v":""}]
[{"$f":"Wniosek!A160","v":8},{"$f":"Wniosek!B160","v":""},null,null,null,{"$f":"Wniosek!F160","v":0},null,{"$f":"Wniosek!H160","v":""}]
[{"$f":"Wniosek!A161","v":9},{"$f":"Wniosek!B161","v":""},null,null,null,{"$f":"Wniosek!F161","v":0},null,{"$f":"Wniosek!H161","v":""}]
[{"$f":"Wniosek!A162","v":10},{"$f":"Wniosek!B162","v":""},null,null,null,{"$f":"Wniosek!F162","v":0},null,{"$f":"Wniosek!H162","v":0}]

{"sheet":"Dane zbiorcze","index":5,"n_rows":2,"n_cols":63,"rows_kept":2,"cut":false,"hidden":true,"merged":[]}
["Nazwa organizatora publicznego transportu zbiorowego","NIP","REGON","Adres","Powiat","Województwo","Imię","Nazwisko","Telefon ","Adres e-mail","Okres",{"$f":"Wniosek!B23","v":"Rodzaj wniosku (w przypadku korekty w polu \"uwagi\" opisać zakres korygowanych wartości)"},"Numer umowy o dopłatę ","Data zawarcia umowy","Kwota niewykorzystanych środków","Przewidywane zapotrzebowanie ","Liczba operatorów","Miesiąc 1","Ogółem liczba wzkm 1 mies.","Ogółem śr własne 1 mies","Ogółem deficyt 1 mies","Ogółem Dopłata 1 mies","Miesiąc 2","Ogółem liczba wzkm 2 mies.","Ogółem śr własne 2 mies","Ogółem deficyt 2 mies","Ogółem Dopłata 2 mies","Miesiąc 3","Ogółem liczba wzkm 3 mies.","Ogółem śr własne 3 mies","Ogółem deficyt 3 mies","Ogółem Dopłata 3 mies","Data","Nazwa operatora 1","Nazwa operatora 2","Nazwa operatora 3","Nazwa operatora 4","Nazwa operatora 5","Nazwa operatora 6","Nazwa operatora 7","Nazwa operatora 8","Nazwa operatora 9","Nazwa operatora 10","NIP Operatora 1","NIP Operatora 2","NIP Operatora 3","NIP Operatora 4","NIP Operatora 5","NIP Operatora 6","NIP Operatora 7","NIP Operatora 8","NIP Operatora 9","NIP Operatora 10","Regon Operatora 1","Regon Operatora 2","Regon Operatora 3","Regon Operatora 4","Regon Operatora 5","Regon Operatora 6","Regon Operatora 7","Regon Operatora 8","Regon Operatora 9","Regon Operatora 10"]
[{"$f":"Wniosek!C4","v":"Proszę wybrać nr umowy z listy rozwijanej w pkt 1 cz. A.3"},{"$f":"Wniosek!C5","v":"Proszę wybrać nr umowy z listy rozwijanej"},{"$f":"Wniosek!C6","v":"Proszę wybrać nr umowy z listy rozwijanej"},{"$f":"Wniosek!C7","v":"Proszę wybrać nr umowy z listy rozwijanej"},{"$f":"Wniosek!C8","v":"Proszę wybrać nr umowy z listy rozwijanej"},{"$f":"Wniosek!C9","v":"mazowieckie"},{"$f":"Wniosek!C12","v":0},{"$f":"Wniosek!C13","v":0},{"$f":"Wniosek!C14","v":0},{"$f":"Wniosek!C15","v":0},{"$f":"Wniosek!E19","v":"I KWARTAŁ"},{"$f":"Wniosek!G23","v":0},{"$f":"Wniosek!G24","v":0},{"$f":"Wniosek!G25","v":""},{"$f":"Wniosek!G26","v":0},{"$f":"Wniosek!G27","v":0},{"$f":"Wniosek!G28","v":0},{"$f":"Wniosek!D165","v":"STYCZEŃ"},{"$f":"Wniosek!C283","v":0},{"$f":"Wniosek!H283","v":0},{"$f":"Wniosek!E283","v":0},{"$f":"Wniosek!I283","v":0},{"$f":"Wniosek!D286","v":"LUTY"},{"$f":"Wniosek!C404","v":0},{"$f":"Wniosek!H404","v":0},{"$f":"Wniosek!E404","v":0},{"$f":"Wniosek!I404","v":0},{"$f":"Wniosek!D407","v":"MARZEC"},{"$f":"Wniosek!C525","v":0},{"$f":"Wniosek!H525","v":0},{"$f":"Wniosek!E525","v":0},{"$f":"Wniosek!I525","v":0},{"$f":"Wniosek!I1","v":"00:00:00"},{"$f":"Wniosek!B153","v":0},{"$f":"Wniosek!B154","v":0},{"$f":"Wniosek!B155","v":0},{"$f":"Wniosek!B156","v":0},{"$f":"Wniosek!B157","v":0},{"$f":"Wniosek!B158","v":""},{"$f":"Wniosek!B159","v":""},{"$f":"Wniosek!B160","v":""},{"$f":"Wniosek!B161","v":""},{"$f":"Wniosek!B162","v":""},{"$f":"Wniosek!F153","v":0},{"$f":"Wniosek!F154","v":0},{"$f":"Wniosek!F155","v":0},{"$f":"Wniosek!F156","v":0},{"$f":"Wniosek!F157","v":0},{"$f":"Wniosek!F158","v":0},{"$f":"Wniosek!F160","v":0},{"$f":"Wniosek!F161","v":0},{"$f":"Wniosek!F162","v":0},{"$f":"Wniosek!F163","v":0},{"$f":"Wniosek!H153","v":0},{"$f":"Wniosek!H154","v":0},{"$f":"Wniosek!H155","v":""},{"$f":"Wniosek!H156","v":""},{"$f":"Wniosek!H157","v":""},{"$f":"Wniosek!H158","v":""},{"$f":"Wniosek!H159","v":""},{"$f":"Wniosek!H160","v":""},{"$f":"Wniosek!H161","v":""},{"$f":"Wniosek!H162","v":0}]

{"sheet":"Do wniosku","index":6,"n_rows":2,"n_cols":11,"rows_kept":2,"cut":false,"hidden":true,"merged":[]}
["Nazwa organizatora","Kwota łącznie","Łączna wielkość pracy eksploatacyjnej  (wozokilometry)","Ilość operatorów","Liczba linii","Zapotrzebowanie na kolejny kwartał","Okres","Nr umowy","Data umowy","Tytuł","Wersja wzoru"]
[{"$f":"Wniosek!C4","v":"Proszę wybrać nr umowy z listy rozwijanej w pkt 1 cz. A.3"},{"$f":"Wniosek!H536","v":0},{"$f":"Wniosek!C283+Wniosek!C404+Wniosek!C525","v":0},{"$f":"Wniosek!G28","v":0},{"$f":"Wniosek!G29","v":0},{"$f":"Wniosek!G27","v":0},{"$f":"Wniosek!E19","v":"I KWARTAŁ"},{"$f":"Wniosek!G24","v":0},{"$f":"Wniosek!G25","v":""},{"$f":"CONCATENATE(\"Dopłata FRPA \",Wniosek!E19,\" \",2026,\" \",\"umowa \",Wniosek!G24)","v":"Dopłata FRPA I KWARTAŁ 2026 umowa "},{"$f":"Wniosek!I528","v":"ver. 3.0"}]

{"sheet":"Dane - linie (1)","index":7,"n_rows":116,"n_cols":9,"rows_kept":116,"cut":false,"hidden":true,"merged":[]}
[{"$f":"Wniosek!A166","v":"Lp."},{"$f":"Wniosek!B166","v":"Nazwa linii komunikacyjnej"},{"$f":"Wniosek!C166","v":"Przewidywana wielkość pracy eksploatacyjnej w okresie rozliczeniowym [wzkm]"},{"$f":"Wniosek!D166","v":"Cena usługi [zł]"},{"$f":"Wniosek!E166","v":"Planowany deficyt w okresie rozliczeniowym [zł]"},{"$f":"Wniosek!F166","v":"Część ceny usługi sfinansowana ze środków własnych organizatora \n[zł/wzkm]"},{"$f":"Wniosek!G166","v":"Procentowa wartość części ceny usługi sfinansowanej ze środków własnych organizatora [%]"},{"$f":"Wniosek!H166","v":"Kwota środków własnych organizatora [zł]"},{"$f":"Wniosek!I166","v":"Kwota dopłaty \nw okresie rozliczeniowym \n[zł]"}]
[{"$f":"Wniosek!A168","v":1},{"$f":"Wniosek!B168","v":""},{"$f":"Wniosek!C168","v":0},{"$f":"Wniosek!D168","v":0},{"$f":"Wniosek!E168","v":0},{"$f":"Wniosek!F168","v":0},{"$f":"Wniosek!G168","v":0},{"$f":"Wniosek!H168","v":0},{"$f":"Wniosek!I168","v":0}]
[{"$f":"Wniosek!A169","v":2},{"$f":"Wniosek!B169","v":""},{"$f":"Wniosek!C169","v":0},{"$f":"Wniosek!D169","v":0},{"$f":"Wniosek!E169","v":0},{"$f":"Wniosek!F169","v":0},{"$f":"Wniosek!G169","v":0},{"$f":"Wniosek!H169","v":0},{"$f":"Wniosek!I169","v":0}]
[{"$f":"Wniosek!A170","v":3},{"$f":"Wniosek!B170","v":""},{"$f":"Wniosek!C170","v":0},{"$f":"Wniosek!D170","v":0},{"$f":"Wniosek!E170","v":0},{"$f":"Wniosek!F170","v":0},{"$f":"Wniosek!G170","v":0},{"$f":"Wniosek!H170","v":0},{"$f":"Wniosek!I170","v":0}]
[{"$f":"Wniosek!A171","v":4},{"$f":"Wniosek!B171","v":""},{"$f":"Wniosek!C171","v":0},{"$f":"Wniosek!D171","v":0},{"$f":"Wniosek!E171","v":0},{"$f":"Wniosek!F171","v":0},{"$f":"Wniosek!G171","v":0},{"$f":"Wniosek!H171","v":0},{"$f":"Wniosek!I171","v":0}]
[{"$f":"Wniosek!A172","v":5},{"$f":"Wniosek!B172","v":""},{"$f":"Wniosek!C172","v":0},{"$f":"Wniosek!D172","v":0},{"$f":"Wniosek!E172","v":0},{"$f":"Wniosek!F172","v":0},{"$f":"Wniosek!G172","v":0},{"$f":"Wniosek!H172","v":0},{"$f":"Wniosek!I172","v":0}]
[{"$f":"Wniosek!A173","v":6},{"$f":"Wniosek!B173","v":""},{"$f":"Wniosek!C173","v":0},{"$f":"Wniosek!D173","v":0},{"$f":"Wniosek!E173","v":0},{"$f":"Wniosek!F173","v":0},{"$f":"Wniosek!G173","v":0},{"$f":"Wniosek!H173","v":0},{"$f":"Wniosek!I173","v":0}]
[{"$f":"Wniosek!A174","v":7},{"$f":"Wniosek!B174","v":""},{"$f":"Wniosek!C174","v":0},{"$f":"Wniosek!D174","v":0},{"$f":"Wniosek!E174","v":0},{"$f":"Wniosek!F174","v":0},{"$f":"Wniosek!G174","v":0},{"$f":"Wniosek!H174","v":0},{"$f":"Wniosek!I174","v":0}]
[{"$f":"Wniosek!A175","v":8},{"$f":"Wniosek!B175","v":""},{"$f":"Wniosek!C175","v":0},{"$f":"Wniosek!D175","v":0},{"$f":"Wniosek!E175","v":0},{"$f":"Wniosek!F175","v":0},{"$f":"Wniosek!G175","v":0},{"$f":"Wniosek!H175","v":0},{"$f":"Wniosek!I175","v":0}]
[{"$f":"Wniosek!A176","v":9},{"$f":"Wniosek!B176","v":""},{"$f":"Wniosek!C176","v":0},{"$f":"Wniosek!D176","v":0},{"$f":"Wniosek!E176","v":0},{"$f":"Wniosek!F176","v":0},{"$f":"Wniosek!G176","v":0},{"$f":"Wniosek!H176","v":0},{"$f":"Wniosek!I176","v":0}]
[{"$f":"Wniosek!A177","v":10},{"$f":"Wniosek!B177","v":""},{"$f":"Wniosek!C177","v":0},{"$f":"Wniosek!D177","v":0},{"$f":"Wniosek!E177","v":0},{"$f":"Wniosek!F177","v":0},{"$f":"Wniosek!G177","v":0},{"$f":"Wniosek!H177","v":0},{"$f":"Wniosek!I177","v":0}]
[{"$f":"Wniosek!A178","v":11},{"$f":"Wniosek!B178","v":""},{"$f":"Wniosek!C178","v":0},{"$f":"Wniosek!D178","v":0},{"$f":"Wniosek!E178","v":0},{"$f":"Wniosek!F178","v":0},{"$f":"Wniosek!G178","v":0},{"$f":"Wniosek!H178","v":0},{"$f":"Wniosek!I178","v":0}]
[{"$f":"Wniosek!A179","v":12},{"$f":"Wniosek!B179","v":""},{"$f":"Wniosek!C179","v":0},{"$f":"Wniosek!D179","v":0},{"$f":"Wniosek!E179","v":0},{"$f":"Wniosek!F179","v":0},{"$f":"Wniosek!G179","v":0},{"$f":"Wniosek!H179","v":0},{"$f":"Wniosek!I179","v":0}]
[{"$f":"Wniosek!A180","v":13},{"$f":"Wniosek!B180","v":""},{"$f":"Wniosek!C180","v":0},{"$f":"Wniosek!D180","v":0},{"$f":"Wniosek!E180","v":0},{"$f":"Wniosek!F180","v":0},{"$f":"Wniosek!G180","v":0},{"$f":"Wniosek!H180","v":0},{"$f":"Wniosek!I180","v":0}]
[{"$f":"Wniosek!A181","v":14},{"$f":"Wniosek!B181","v":""},{"$f":"Wniosek!C181","v":0},{"$f":"Wniosek!D181","v":0},{"$f":"Wniosek!E181","v":0},{"$f":"Wniosek!F181","v":0},{"$f":"Wniosek!G181","v":0},{"$f":"Wniosek!H181","v":0},{"$f":"Wniosek!I181","v":0}]
[{"$f":"Wniosek!A182","v":15},{"$f":"Wniosek!B182","v":""},{"$f":"Wniosek!C182","v":0},{"$f":"Wniosek!D182","v":0},{"$f":"Wniosek!E182","v":0},{"$f":"Wniosek!F182","v":0},{"$f":"Wniosek!G182","v":0},{"$f":"Wniosek!H182","v":0},{"$f":"Wniosek!I182","v":0}]
[{"$f":"Wniosek!A183","v":16},{"$f":"Wniosek!B183","v":""},{"$f":"Wniosek!C183","v":0},{"$f":"Wniosek!D183","v":0},{"$f":"Wniosek!E183","v":0},{"$f":"Wniosek!F183","v":0},{"$f":"Wniosek!G183","v":0},{"$f":"Wniosek!H183","v":0},{"$f":"Wniosek!I183","v":0}]
[{"$f":"Wniosek!A184","v":17},{"$f":"Wniosek!B184","v":""},{"$f":"Wniosek!C184","v":0},{"$f":"Wniosek!D184","v":0},{"$f":"Wniosek!E184","v":0},{"$f":"Wniosek!F184","v":0},{"$f":"Wniosek!G184","v":0},{"$f":"Wniosek!H184","v":0},{"$f":"Wniosek!I184","v":0}]
[{"$f":"Wniosek!A185","v":18},{"$f":"Wniosek!B185","v":""},{"$f":"Wniosek!C185","v":0},{"$f":"Wniosek!D185","v":0},{"$f":"Wniosek!E185","v":0},{"$f":"Wniosek!F185","v":0},{"$f":"Wniosek!G185","v":0},{"$f":"Wniosek!H185","v":0},{"$f":"Wniosek!I185","v":0}]
[{"$f":"Wniosek!A186","v":19},{"$f":"Wniosek!B186","v":""},{"$f":"Wniosek!C186","v":0},{"$f":"Wniosek!D186","v":0},{"$f":"Wniosek!E186","v":0},{"$f":"Wniosek!F186","v":0},{"$f":"Wniosek!G186","v":0},{"$f":"Wniosek!H186","v":0},{"$f":"Wniosek!I186","v":0}]
[{"$f":"Wniosek!A187","v":20},{"$f":"Wniosek!B187","v":""},{"$f":"Wniosek!C187","v":0},{"$f":"Wniosek!D187","v":0},{"$f":"Wniosek!E187","v":0},{"$f":"Wniosek!F187","v":0},{"$f":"Wniosek!G187","v":0},{"$f":"Wniosek!H187","v":0},{"$f":"Wniosek!I187","v":0}]
[{"$f":"Wniosek!A188","v":21},{"$f":"Wniosek!B188","v":""},{"$f":"Wniosek!C188","v":0},{"$f":"Wniosek!D188","v":0},{"$f":"Wniosek!E188","v":0},{"$f":"Wniosek!F188","v":0},{"$f":"Wniosek!G188","v":0},{"$f":"Wniosek!H188","v":0},{"$f":"Wniosek!I188","v":0}]
[{"$f":"Wniosek!A189","v":22},{"$f":"Wniosek!B189","v":""},{"$f":"Wniosek!C189","v":0},{"$f":"Wniosek!D189","v":0},{"$f":"Wniosek!E189","v":0},{"$f":"Wniosek!F189","v":0},{"$f":"Wniosek!G189","v":0},{"$f":"Wniosek!H189","v":0},{"$f":"Wniosek!I189","v":0}]
[{"$f":"Wniosek!A190","v":23},{"$f":"Wniosek!B190","v":""},{"$f":"Wniosek!C190","v":0},{"$f":"Wniosek!D190","v":0},{"$f":"Wniosek!E190","v":0},{"$f":"Wniosek!F190","v":0},{"$f":"Wniosek!G190","v":0},{"$f":"Wniosek!H190","v":0},{"$f":"Wniosek!I190","v":0}]
[{"$f":"Wniosek!A191","v":24},{"$f":"Wniosek!B191","v":""},{"$f":"Wniosek!C191","v":0},{"$f":"Wniosek!D191","v":0},{"$f":"Wniosek!E191","v":0},{"$f":"Wniosek!F191","v":0},{"$f":"Wniosek!G191","v":0},{"$f":"Wniosek!H191","v":0},{"$f":"Wniosek!I191","v":0}]
[{"$f":"Wniosek!A192","v":25},{"$f":"Wniosek!B192","v":""},{"$f":"Wniosek!C192","v":0},{"$f":"Wniosek!D192","v":0},{"$f":"Wniosek!E192","v":0},{"$f":"Wniosek!F192","v":0},{"$f":"Wniosek!G192","v":0},{"$f":"Wniosek!H192","v":0},{"$f":"Wniosek!I192","v":0}]
[{"$f":"Wniosek!A193","v":26},{"$f":"Wniosek!B193","v":""},{"$f":"Wniosek!C193","v":0},{"$f":"Wniosek!D193","v":0},{"$f":"Wniosek!E193","v":0},{"$f":"Wniosek!F193","v":0},{"$f":"Wniosek!G193","v":0},{"$f":"Wniosek!H193","v":0},{"$f":"Wniosek!I193","v":0}]
[{"$f":"Wniosek!A194","v":27},{"$f":"Wniosek!B194","v":""},{"$f":"Wniosek!C194","v":0},{"$f":"Wniosek!D194","v":0},{"$f":"Wniosek!E194","v":0},{"$f":"Wniosek!F194","v":0},{"$f":"Wniosek!G194","v":0},{"$f":"Wniosek!H194","v":0},{"$f":"Wniosek!I194","v":0}]
[{"$f":"Wniosek!A195","v":28},{"$f":"Wniosek!B195","v":""},{"$f":"Wniosek!C195","v":0},{"$f":"Wniosek!D195","v":0},{"$f":"Wniosek!E195","v":0},{"$f":"Wniosek!F195","v":0},{"$f":"Wniosek!G195","v":0},{"$f":"Wniosek!H195","v":0},{"$f":"Wniosek!I195","v":0}]
[{"$f":"Wniosek!A196","v":29},{"$f":"Wniosek!B196","v":""},{"$f":"Wniosek!C196","v":0},{"$f":"Wniosek!D196","v":0},{"$f":"Wniosek!E196","v":0},{"$f":"Wniosek!F196","v":0},{"$f":"Wniosek!G196","v":0},{"$f":"Wniosek!H196","v":0},{"$f":"Wniosek!I196","v":0}]
[{"$f":"Wniosek!A197","v":30},{"$f":"Wniosek!B197","v":""},{"$f":"Wniosek!C197","v":0},{"$f":"Wniosek!D197","v":0},{"$f":"Wniosek!E197","v":0},{"$f":"Wniosek!F197","v":0},{"$f":"Wniosek!G197","v":0},{"$f":"Wniosek!H197","v":0},{"$f":"Wniosek!I197","v":0}]
[{"$f":"Wniosek!A198","v":31},{"$f":"Wniosek!B198","v":""},{"$f":"Wniosek!C198","v":0},{"$f":"Wniosek!D198","v":0},{"$f":"Wniosek!E198","v":0},{"$f":"Wniosek!F198","v":0},{"$f":"Wniosek!G198","v":0},{"$f":"Wniosek!H198","v":0},{"$f":"Wniosek!I198","v":0}]
[{"$f":"Wniosek!A199","v":32},{"$f":"Wniosek!B199","v":""},{"$f":"Wniosek!C199","v":0},{"$f":"Wniosek!D199","v":0},{"$f":"Wniosek!E199","v":0},{"$f":"Wniosek!F199","v":0},{"$f":"Wniosek!G199","v":0},{"$f":"Wniosek!H199","v":0},{"$f":"Wniosek!I199","v":0}]
[{"$f":"Wniosek!A200","v":33},{"$f":"Wniosek!B200","v":""},{"$f":"Wniosek!C200","v":0},{"$f":"Wniosek!D200","v":0},{"$f":"Wniosek!E200","v":0},{"$f":"Wniosek!F200","v":0},{"$f":"Wniosek!G200","v":0},{"$f":"Wniosek!H200","v":0},{"$f":"Wniosek!I200","v":0}]
[{"$f":"Wniosek!A201","v":34},{"$f":"Wniosek!B201","v":""},{"$f":"Wniosek!C201","v":0},{"$f":"Wniosek!D201","v":0},{"$f":"Wniosek!E201","v":0},{"$f":"Wniosek!F201","v":0},{"$f":"Wniosek!G201","v":0},{"$f":"Wniosek!H201","v":0},{"$f":"Wniosek!I201","v":0}]
[{"$f":"Wniosek!A202","v":35},{"$f":"Wniosek!B202","v":""},{"$f":"Wniosek!C202","v":0},{"$f":"Wniosek!D202","v":0},{"$f":"Wniosek!E202","v":0},{"$f":"Wniosek!F202","v":0},{"$f":"Wniosek!G202","v":0},{"$f":"Wniosek!H202","v":0},{"$f":"Wniosek!I202","v":0}]
[{"$f":"Wniosek!A203","v":36},{"$f":"Wniosek!B203","v":""},{"$f":"Wniosek!C203","v":0},{"$f":"Wniosek!D203","v":0},{"$f":"Wniosek!E203","v":0},{"$f":"Wniosek!F203","v":0},{"$f":"Wniosek!G203","v":0},{"$f":"Wniosek!H203","v":0},{"$f":"Wniosek!I203","v":0}]
[{"$f":"Wniosek!A204","v":37},{"$f":"Wniosek!B204","v":""},{"$f":"Wniosek!C204","v":0},{"$f":"Wniosek!D204","v":0},{"$f":"Wniosek!E204","v":0},{"$f":"Wniosek!F204","v":0},{"$f":"Wniosek!G204","v":0},{"$f":"Wniosek!H204","v":0},{"$f":"Wniosek!I204","v":0}]
[{"$f":"Wniosek!A205","v":38},{"$f":"Wniosek!B205","v":""},{"$f":"Wniosek!C205","v":0},{"$f":"Wniosek!D205","v":0},{"$f":"Wniosek!E205","v":0},{"$f":"Wniosek!F205","v":0},{"$f":"Wniosek!G205","v":0},{"$f":"Wniosek!H205","v":0},{"$f":"Wniosek!I205","v":0}]
[{"$f":"Wniosek!A206","v":39},{"$f":"Wniosek!B206","v":""},{"$f":"Wniosek!C206","v":0},{"$f":"Wniosek!D206","v":0},{"$f":"Wniosek!E206","v":0},{"$f":"Wniosek!F206","v":0},{"$f":"Wniosek!G206","v":0},{"$f":"Wniosek!H206","v":0},{"$f":"Wniosek!I206","v":0}]
[{"$f":"Wniosek!A207","v":40},{"$f":"Wniosek!B207","v":""},{"$f":"Wniosek!C207","v":0},{"$f":"Wniosek!D207","v":0},{"$f":"Wniosek!E207","v":0},{"$f":"Wniosek!F207","v":0},{"$f":"Wniosek!G207","v":0},{"$f":"Wniosek!H207","v":0},{"$f":"Wniosek!I207","v":0}]
[{"$f":"Wniosek!A208","v":41},{"$f":"Wniosek!B208","v":""},{"$f":"Wniosek!C208","v":0},{"$f":"Wniosek!D208","v":0},{"$f":"Wniosek!E208","v":0},{"$f":"Wniosek!F208","v":0},{"$f":"Wniosek!G208","v":0},{"$f":"Wniosek!H208","v":0},{"$f":"Wniosek!I208","v":0}]
[{"$f":"Wniosek!A209","v":42},{"$f":"Wniosek!B209","v":""},{"$f":"Wniosek!C209","v":0},{"$f":"Wniosek!D209","v":0},{"$f":"Wniosek!E209","v":0},{"$f":"Wniosek!F209","v":0},{"$f":"Wniosek!G209","v":0},{"$f":"Wniosek!H209","v":0},{"$f":"Wniosek!I209","v":0}]
[{"$f":"Wniosek!A210","v":43},{"$f":"Wniosek!B210","v":""},{"$f":"Wniosek!C210","v":0},{"$f":"Wniosek!D210","v":0},{"$f":"Wniosek!E210","v":0},{"$f":"Wniosek!F210","v":0},{"$f":"Wniosek!G210","v":0},{"$f":"Wniosek!H210","v":0},{"$f":"Wniosek!I210","v":0}]
[{"$f":"Wniosek!A211","v":44},{"$f":"Wniosek!B211","v":""},{"$f":"Wniosek!C211","v":0},{"$f":"Wniosek!D211","v":0},{"$f":"Wniosek!E211","v":0},{"$f":"Wniosek!F211","v":0},{"$f":"Wniosek!G211","v":0},{"$f":"Wniosek!H211","v":0},{"$f":"Wniosek!I211","v":0}]
[{"$f":"Wniosek!A212","v":45},{"$f":"Wniosek!B212","v":""},{"$f":"Wniosek!C212","v":0},{"$f":"Wniosek!D212","v":0},{"$f":"Wniosek!E212","v":0},{"$f":"Wniosek!F212","v":0},{"$f":"Wniosek!G212","v":0},{"$f":"Wniosek!H212","v":0},{"$f":"Wniosek!I212","v":0}]
[{"$f":"Wniosek!A213","v":46},{"$f":"Wniosek!B213","v":""},{"$f":"Wniosek!C213","v":0},{"$f":"Wniosek!D213","v":0},{"$f":"Wniosek!E213","v":0},{"$f":"Wniosek!F213","v":0},{"$f":"Wniosek!G213","v":0},{"$f":"Wniosek!H213","v":0},{"$f":"Wniosek!I213","v":0}]
[{"$f":"Wniosek!A214","v":47},{"$f":"Wniosek!B214","v":""},{"$f":"Wniosek!C214","v":0},{"$f":"Wniosek!D214","v":0},{"$f":"Wniosek!E214","v":0},{"$f":"Wniosek!F214","v":0},{"$f":"Wniosek!G214","v":0},{"$f":"Wniosek!H214","v":0},{"$f":"Wniosek!I214","v":0}]
[{"$f":"Wniosek!A215","v":48},{"$f":"Wniosek!B215","v":""},{"$f":"Wniosek!C215","v":0},{"$f":"Wniosek!D215","v":0},{"$f":"Wniosek!E215","v":0},{"$f":"Wniosek!F215","v":0},{"$f":"Wniosek!G215","v":0},{"$f":"Wniosek!H215","v":0},{"$f":"Wniosek!I215","v":0}]
[{"$f":"Wniosek!A216","v":49},{"$f":"Wniosek!B216","v":""},{"$f":"Wniosek!C216","v":0},{"$f":"Wniosek!D216","v":0},{"$f":"Wniosek!E216","v":0},{"$f":"Wniosek!F216","v":0},{"$f":"Wniosek!G216","v":0},{"$f":"Wniosek!H216","v":0},{"$f":"Wniosek!I216","v":0}]
[{"$f":"Wniosek!A217","v":50},{"$f":"Wniosek!B217","v":""},{"$f":"Wniosek!C217","v":0},{"$f":"Wniosek!D217","v":0},{"$f":"Wniosek!E217","v":0},{"$f":"Wniosek!F217","v":0},{"$f":"Wniosek!G217","v":0},{"$f":"Wniosek!H217","v":0},{"$f":"Wniosek!I217","v":0}]
[{"$f":"Wniosek!A218","v":51},{"$f":"Wniosek!B218","v":""},{"$f":"Wniosek!C218","v":0},{"$f":"Wniosek!D218","v":0},{"$f":"Wniosek!E218","v":0},{"$f":"Wniosek!F218","v":0},{"$f":"Wniosek!G218","v":0},{"$f":"Wniosek!H218","v":0},{"$f":"Wniosek!I218","v":0}]
[{"$f":"Wniosek!A219","v":52},{"$f":"Wniosek!B219","v":""},{"$f":"Wniosek!C219","v":0},{"$f":"Wniosek!D219","v":0},{"$f":"Wniosek!E219","v":0},{"$f":"Wniosek!F219","v":0},{"$f":"Wniosek!G219","v":0},{"$f":"Wniosek!H219","v":0},{"$f":"Wniosek!I219","v":0}]
[{"$f":"Wniosek!A220","v":53},{"$f":"Wniosek!B220","v":""},{"$f":"Wniosek!C220","v":0},{"$f":"Wniosek!D220","v":0},{"$f":"Wniosek!E220","v":0},{"$f":"Wniosek!F220","v":0},{"$f":"Wniosek!G220","v":0},{"$f":"Wniosek!H220","v":0},{"$f":"Wniosek!I220","v":0}]
[{"$f":"Wniosek!A221","v":54},{"$f":"Wniosek!B221","v":""},{"$f":"Wniosek!C221","v":0},{"$f":"Wniosek!D221","v":0},{"$f":"Wniosek!E221","v":0},{"$f":"Wniosek!F221","v":0},{"$f":"Wniosek!G221","v":0},{"$f":"Wniosek!H221","v":0},{"$f":"Wniosek!I221","v":0}]
[{"$f":"Wniosek!A222","v":55},{"$f":"Wniosek!B222","v":""},{"$f":"Wniosek!C222","v":0},{"$f":"Wniosek!D222","v":0},{"$f":"Wniosek!E222","v":0},{"$f":"Wniosek!F222","v":0},{"$f":"Wniosek!G222","v":0},{"$f":"Wniosek!H222","v":0},{"$f":"Wniosek!I222","v":0}]
[{"$f":"Wniosek!A223","v":56},{"$f":"Wniosek!B223","v":""},{"$f":"Wniosek!C223","v":0},{"$f":"Wniosek!D223","v":0},{"$f":"Wniosek!E223","v":0},{"$f":"Wniosek!F223","v":0},{"$f":"Wniosek!G223","v":0},{"$f":"Wniosek!H223","v":0},{"$f":"Wniosek!I223","v":0}]
[{"$f":"Wniosek!A224","v":57},{"$f":"Wniosek!B224","v":""},{"$f":"Wniosek!C224","v":0},{"$f":"Wniosek!D224","v":0},{"$f":"Wniosek!E224","v":0},{"$f":"Wniosek!F224","v":0},{"$f":"Wniosek!G224","v":0},{"$f":"Wniosek!H224","v":0},{"$f":"Wniosek!I224","v":0}]
[{"$f":"Wniosek!A225","v":58},{"$f":"Wniosek!B225","v":""},{"$f":"Wniosek!C225","v":0},{"$f":"Wniosek!D225","v":0},{"$f":"Wniosek!E225","v":0},{"$f":"Wniosek!F225","v":0},{"$f":"Wniosek!G225","v":0},{"$f":"Wniosek!H225","v":0},{"$f":"Wniosek!I225","v":0}]
[{"$f":"Wniosek!A226","v":59},{"$f":"Wniosek!B226","v":""},{"$f":"Wniosek!C226","v":0},{"$f":"Wniosek!D226","v":0},{"$f":"Wniosek!E226","v":0},{"$f":"Wniosek!F226","v":0},{"$f":"Wniosek!G226","v":0},{"$f":"Wniosek!H226","v":0},{"$f":"Wniosek!I226","v":0}]
[{"$f":"Wniosek!A227","v":60},{"$f":"Wniosek!B227","v":""},{"$f":"Wniosek!C227","v":0},{"$f":"Wniosek!D227","v":0},{"$f":"Wniosek!E227","v":0},{"$f":"Wniosek!F227","v":0},{"$f":"Wniosek!G227","v":0},{"$f":"Wniosek!H227","v":0},{"$f":"Wniosek!I227","v":0}]
[{"$f":"Wniosek!A228","v":61},{"$f":"Wniosek!B228","v":""},{"$f":"Wniosek!C228","v":0},{"$f":"Wniosek!D228","v":0},{"$f":"Wniosek!E228","v":0},{"$f":"Wniosek!F228","v":0},{"$f":"Wniosek!G228","v":0},{"$f":"Wniosek!H228","v":0},{"$f":"Wniosek!I228","v":0}]
[{"$f":"Wniosek!A229","v":62},{"$f":"Wniosek!B229","v":""},{"$f":"Wniosek!C229","v":0},{"$f":"Wniosek!D229","v":0},{"$f":"Wniosek!E229","v":0},{"$f":"Wniosek!F229","v":0},{"$f":"Wniosek!G229","v":0},{"$f":"Wniosek!H229","v":0},{"$f":"Wniosek!I229","v":0}]
[{"$f":"Wniosek!A230","v":63},{"$f":"Wniosek!B230","v":""},{"$f":"Wniosek!C230","v":0},{"$f":"Wniosek!D230","v":0},{"$f":"Wniosek!E230","v":0},{"$f":"Wniosek!F230","v":0},{"$f":"Wniosek!G230","v":0},{"$f":"Wniosek!H230","v":0},{"$f":"Wniosek!I230","v":0}]
[{"$f":"Wniosek!A231","v":64},{"$f":"Wniosek!B231","v":""},{"$f":"Wniosek!C231","v":0},{"$f":"Wniosek!D231","v":0},{"$f":"Wniosek!E231","v":0},{"$f":"Wniosek!F231","v":0},{"$f":"Wniosek!G231","v":0},{"$f":"Wniosek!H231","v":0},{"$f":"Wniosek!I231","v":0}]
[{"$f":"Wniosek!A232","v":65},{"$f":"Wniosek!B232","v":""},{"$f":"Wniosek!C232","v":0},{"$f":"Wniosek!D232","v":0},{"$f":"Wniosek!E232","v":0},{"$f":"Wniosek!F232","v":0},{"$f":"Wniosek!G232","v":0},{"$f":"Wniosek!H232","v":0},{"$f":"Wniosek!I232","v":0}]
[{"$f":"Wniosek!A233","v":66},{"$f":"Wniosek!B233","v":""},{"$f":"Wniosek!C233","v":0},{"$f":"Wniosek!D233","v":0},{"$f":"Wniosek!E233","v":0},{"$f":"Wniosek!F233","v":0},{"$f":"Wniosek!G233","v":0},{"$f":"Wniosek!H233","v":0},{"$f":"Wniosek!I233","v":0}]
[{"$f":"Wniosek!A234","v":67},{"$f":"Wniosek!B234","v":""},{"$f":"Wniosek!C234","v":0},{"$f":"Wniosek!D234","v":0},{"$f":"Wniosek!E234","v":0},{"$f":"Wniosek!F234","v":0},{"$f":"Wniosek!G234","v":0},{"$f":"Wniosek!H234","v":0},{"$f":"Wniosek!I234","v":0}]
[{"$f":"Wniosek!A235","v":68},{"$f":"Wniosek!B235","v":""},{"$f":"Wniosek!C235","v":0},{"$f":"Wniosek!D235","v":0},{"$f":"Wniosek!E235","v":0},{"$f":"Wniosek!F235","v":0},{"$f":"Wniosek!G235","v":0},{"$f":"Wniosek!H235","v":0},{"$f":"Wniosek!I235","v":0}]
[{"$f":"Wniosek!A236","v":69},{"$f":"Wniosek!B236","v":""},{"$f":"Wniosek!C236","v":0},{"$f":"Wniosek!D236","v":0},{"$f":"Wniosek!E236","v":0},{"$f":"Wniosek!F236","v":0},{"$f":"Wniosek!G236","v":0},{"$f":"Wniosek!H236","v":0},{"$f":"Wniosek!I236","v":0}]
[{"$f":"Wniosek!A237","v":70},{"$f":"Wniosek!B237","v":""},{"$f":"Wniosek!C237","v":0},{"$f":"Wniosek!D237","v":0},{"$f":"Wniosek!E237","v":0},{"$f":"Wniosek!F237","v":0},{"$f":"Wniosek!G237","v":0},{"$f":"Wniosek!H237","v":0},{"$f":"Wniosek!I237","v":0}]
[{"$f":"Wniosek!A238","v":71},{"$f":"Wniosek!B238","v":""},{"$f":"Wniosek!C238","v":0},{"$f":"Wniosek!D238","v":0},{"$f":"Wniosek!E238","v":0},{"$f":"Wniosek!F238","v":0},{"$f":"Wniosek!G238","v":0},{"$f":"Wniosek!H238","v":0},{"$f":"Wniosek!I238","v":0}]
[{"$f":"Wniosek!A239","v":72},{"$f":"Wniosek!B239","v":""},{"$f":"Wniosek!C239","v":0},{"$f":"Wniosek!D239","v":0},{"$f":"Wniosek!E239","v":0},{"$f":"Wniosek!F239","v":0},{"$f":"Wniosek!G239","v":0},{"$f":"Wniosek!H239","v":0},{"$f":"Wniosek!I239","v":0}]
[{"$f":"Wniosek!A240","v":73},{"$f":"Wniosek!B240","v":""},{"$f":"Wniosek!C240","v":0},{"$f":"Wniosek!D240","v":0},{"$f":"Wniosek!E240","v":0},{"$f":"Wniosek!F240","v":0},{"$f":"Wniosek!G240","v":0},{"$f":"Wniosek!H240","v":0},{"$f":"Wniosek!I240","v":0}]
[{"$f":"Wniosek!A241","v":74},{"$f":"Wniosek!B241","v":""},{"$f":"Wniosek!C241","v":0},{"$f":"Wniosek!D241","v":0},{"$f":"Wniosek!E241","v":0},{"$f":"Wniosek!F241","v":0},{"$f":"Wniosek!G241","v":0},{"$f":"Wniosek!H241","v":0},{"$f":"Wniosek!I241","v":0}]
[{"$f":"Wniosek!A242","v":75},{"$f":"Wniosek!B242","v":""},{"$f":"Wniosek!C242","v":0},{"$f":"Wniosek!D242","v":0},{"$f":"Wniosek!E242","v":0},{"$f":"Wniosek!F242","v":0},{"$f":"Wniosek!G242","v":0},{"$f":"Wniosek!H242","v":0},{"$f":"Wniosek!I242","v":0}]
[{"$f":"Wniosek!A243","v":76},{"$f":"Wniosek!B243","v":""},{"$f":"Wniosek!C243","v":0},{"$f":"Wniosek!D243","v":0},{"$f":"Wniosek!E243","v":0},{"$f":"Wniosek!F243","v":0},{"$f":"Wniosek!G243","v":0},{"$f":"Wniosek!H243","v":0},{"$f":"Wniosek!I243","v":0}]
[{"$f":"Wniosek!A244","v":77},{"$f":"Wniosek!B244","v":""},{"$f":"Wniosek!C244","v":0},{"$f":"Wniosek!D244","v":0},{"$f":"Wniosek!E244","v":0},{"$f":"Wniosek!F244","v":0},{"$f":"Wniosek!G244","v":0},{"$f":"Wniosek!H244","v":0},{"$f":"Wniosek!I244","v":0}]
[{"$f":"Wniosek!A245","v":78},{"$f":"Wniosek!B245","v":""},{"$f":"Wniosek!C245","v":0},{"$f":"Wniosek!D245","v":0},{"$f":"Wniosek!E245","v":0},{"$f":"Wniosek!F245","v":0},{"$f":"Wniosek!G245","v":0},{"$f":"Wniosek!H245","v":0},{"$f":"Wniosek!I245","v":0}]
[{"$f":"Wniosek!A246","v":79},{"$f":"Wniosek!B246","v":""},{"$f":"Wniosek!C246","v":0},{"$f":"Wniosek!D246","v":0},{"$f":"Wniosek!E246","v":0},{"$f":"Wniosek!F246","v":0},{"$f":"Wniosek!G246","v":0},{"$f":"Wniosek!H246","v":0},{"$f":"Wniosek!I246","v":0}]
[{"$f":"Wniosek!A247","v":80},{"$f":"Wniosek!B247","v":""},{"$f":"Wniosek!C247","v":0},{"$f":"Wniosek!D247","v":0},{"$f":"Wniosek!E247","v":0},{"$f":"Wniosek!F247","v":0},{"$f":"Wniosek!G247","v":0},{"$f":"Wniosek!H247","v":0},{"$f":"Wniosek!I247","v":0}]
[{"$f":"Wniosek!A248","v":81},{"$f":"Wniosek!B248","v":""},{"$f":"Wniosek!C248","v":0},{"$f":"Wniosek!D248","v":0},{"$f":"Wniosek!E248","v":0},{"$f":"Wniosek!F248","v":0},{"$f":"Wniosek!G248","v":0},{"$f":"Wniosek!H248","v":0},{"$f":"Wniosek!I248","v":0}]
[{"$f":"Wniosek!A249","v":82},{"$f":"Wniosek!B249","v":""},{"$f":"Wniosek!C249","v":0},{"$f":"Wniosek!D249","v":0},{"$f":"Wniosek!E249","v":0},{"$f":"Wniosek!F249","v":0},{"$f":"Wniosek!G249","v":0},{"$f":"Wniosek!H249","v":0},{"$f":"Wniosek!I249","v":0}]
[{"$f":"Wniosek!A250","v":83},{"$f":"Wniosek!B250","v":""},{"$f":"Wniosek!C250","v":0},{"$f":"Wniosek!D250","v":0},{"$f":"Wniosek!E250","v":0},{"$f":"Wniosek!F250","v":0},{"$f":"Wniosek!G250","v":0},{"$f":"Wniosek!H250","v":0},{"$f":"Wniosek!I250","v":0}]
[{"$f":"Wniosek!A251","v":84},{"$f":"Wniosek!B251","v":""},{"$f":"Wniosek!C251","v":0},{"$f":"Wniosek!D251","v":0},{"$f":"Wniosek!E251","v":0},{"$f":"Wniosek!F251","v":0},{"$f":"Wniosek!G251","v":0},{"$f":"Wniosek!H251","v":0},{"$f":"Wniosek!I251","v":0}]
[{"$f":"Wniosek!A252","v":85},{"$f":"Wniosek!B252","v":""},{"$f":"Wniosek!C252","v":0},{"$f":"Wniosek!D252","v":0},{"$f":"Wniosek!E252","v":0},{"$f":"Wniosek!F252","v":0},{"$f":"Wniosek!G252","v":0},{"$f":"Wniosek!H252","v":0},{"$f":"Wniosek!I252","v":0}]
[{"$f":"Wniosek!A253","v":86},{"$f":"Wniosek!B253","v":""},{"$f":"Wniosek!C253","v":0},{"$f":"Wniosek!D253","v":0},{"$f":"Wniosek!E253","v":0},{"$f":"Wniosek!F253","v":0},{"$f":"Wniosek!G253","v":0},{"$f":"Wniosek!H253","v":0},{"$f":"Wniosek!I253","v":0}]
[{"$f":"Wniosek!A254","v":87},{"$f":"Wniosek!B254","v":""},{"$f":"Wniosek!C254","v":0},{"$f":"Wniosek!D254","v":0},{"$f":"Wniosek!E254","v":0},{"$f":"Wniosek!F254","v":0},{"$f":"Wniosek!G254","v":0},{"$f":"Wniosek!H254","v":0},{"$f":"Wniosek!I254","v":0}]
[{"$f":"Wniosek!A255","v":88},{"$f":"Wniosek!B255","v":""},{"$f":"Wniosek!C255","v":0},{"$f":"Wniosek!D255","v":0},{"$f":"Wniosek!E255","v":0},{"$f":"Wniosek!F255","v":0},{"$f":"Wniosek!G255","v":0},{"$f":"Wniosek!H255","v":0},{"$f":"Wniosek!I255","v":0}]
[{"$f":"Wniosek!A256","v":89},{"$f":"Wniosek!B256","v":""},{"$f":"Wniosek!C256","v":0},{"$f":"Wniosek!D256","v":0},{"$f":"Wniosek!E256","v":0},{"$f":"Wniosek!F256","v":0},{"$f":"Wniosek!G256","v":0},{"$f":"Wniosek!H256","v":0},{"$f":"Wniosek!I256","v":0}]
[{"$f":"Wniosek!A257","v":90},{"$f":"Wniosek!B257","v":""},{"$f":"Wniosek!C257","v":0},{"$f":"Wniosek!D257","v":0},{"$f":"Wniosek!E257","v":0},{"$f":"Wniosek!F257","v":0},{"$f":"Wniosek!G257","v":0},{"$f":"Wniosek!H257","v":0},{"$f":"Wniosek!I257","v":0}]
[{"$f":"Wniosek!A258","v":91},{"$f":"Wniosek!B258","v":""},{"$f":"Wniosek!C258","v":0},{"$f":"Wniosek!D258","v":0},{"$f":"Wniosek!E258","v":0},{"$f":"Wniosek!F258","v":0},{"$f":"Wniosek!G258","v":0},{"$f":"Wniosek!H258","v":0},{"$f":"Wniosek!I258","v":0}]
[{"$f":"Wniosek!A259","v":92},{"$f":"Wniosek!B259","v":""},{"$f":"Wniosek!C259","v":0},{"$f":"Wniosek!D259","v":0},{"$f":"Wniosek!E259","v":0},{"$f":"Wniosek!F259","v":0},{"$f":"Wniosek!G259","v":0},{"$f":"Wniosek!H259","v":0},{"$f":"Wniosek!I259","v":0}]
[{"$f":"Wniosek!A260","v":93},{"$f":"Wniosek!B260","v":""},{"$f":"Wniosek!C260","v":0},{"$f":"Wniosek!D260","v":0},{"$f":"Wniosek!E260","v":0},{"$f":"Wniosek!F260","v":0},{"$f":"Wniosek!G260","v":0},{"$f":"Wniosek!H260","v":0},{"$f":"Wniosek!I260","v":0}]
[{"$f":"Wniosek!A261","v":94},{"$f":"Wniosek!B261","v":""},{"$f":"Wniosek!C261","v":0},{"$f":"Wniosek!D261","v":0},{"$f":"Wniosek!E261","v":0},{"$f":"Wniosek!F261","v":0},{"$f":"Wniosek!G261","v":0},{"$f":"Wniosek!H261","v":0},{"$f":"Wniosek!I261","v":0}]
[{"$f":"Wniosek!A262","v":95},{"$f":"Wniosek!B262","v":""},{"$f":"Wniosek!C262","v":0},{"$f":"Wniosek!D262","v":0},{"$f":"Wniosek!E262","v":0},{"$f":"Wniosek!F262","v":0},{"$f":"Wniosek!G262","v":0},{"$f":"Wniosek!H262","v":0},{"$f":"Wniosek!I262","v":0}]
[{"$f":"Wniosek!A263","v":96},{"$f":"Wniosek!B263","v":""},{"$f":"Wniosek!C263","v":0},{"$f":"Wniosek!D263","v":0},{"$f":"Wniosek!E263","v":0},{"$f":"Wniosek!F263","v":0},{"$f":"Wniosek!G263","v":0},{"$f":"Wniosek!H263","v":0},{"$f":"Wniosek!I263","v":0}]
[{"$f":"Wniosek!A264","v":97},{"$f":"Wniosek!B264","v":""},{"$f":"Wniosek!C264","v":0},{"$f":"Wniosek!D264","v":0},{"$f":"Wniosek!E264","v":0},{"$f":"Wniosek!F264","v":0},{"$f":"Wniosek!G264","v":0},{"$f":"Wniosek!H264","v":0},{"$f":"Wniosek!I264","v":0}]
[{"$f":"Wniosek!A265","v":98},{"$f":"Wniosek!B265","v":""},{"$f":"Wniosek!C265","v":0},{"$f":"Wniosek!D265","v":0},{"$f":"Wniosek!E265","v":0},{"$f":"Wniosek!F265","v":0},{"$f":"Wniosek!G265","v":0},{"$f":"Wniosek!H265","v":0},{"$f":"Wniosek!I265","v":0}]
[{"$f":"Wniosek!A266","v":99},{"$f":"Wniosek!B266","v":""},{"$f":"Wniosek!C266","v":0},{"$f":"Wniosek!D266","v":0},{"$f":"Wniosek!E266","v":0},{"$f":"Wniosek!F266","v":0},{"$f":"Wniosek!G266","v":0},{"$f":"Wniosek!H266","v":0},{"$f":"Wniosek!I266","v":0}]
[{"$f":"Wniosek!A267","v":100},{"$f":"Wniosek!B267","v":""},{"$f":"Wniosek!C267","v":0},{"$f":"Wniosek!D267","v":0},{"$f":"Wniosek!E267","v":0},{"$f":"Wniosek!F267","v":0},{"$f":"Wniosek!G267","v":0},{"$f":"Wniosek!H267","v":0},{"$f":"Wniosek!I267","v":0}]
[{"$f":"Wniosek!A268","v":101},{"$f":"Wniosek!B268","v":""},{"$f":"Wniosek!C268","v":0},{"$f":"Wniosek!D268","v":0},{"$f":"Wniosek!E268","v":0},{"$f":"Wniosek!F268","v":0},{"$f":"Wniosek!G268","v":0},{"$f":"Wniosek!H268","v":0},{"$f":"Wniosek!I268","v":0}]
[{"$f":"Wniosek!A269","v":102},{"$f":"Wniosek!B269","v":""},{"$f":"Wniosek!C269","v":0},{"$f":"Wniosek!D269","v":0},{"$f":"Wniosek!E269","v":0},{"$f":"Wniosek!F269","v":0},{"$f":"Wniosek!G269","v":0},{"$f":"Wniosek!H269","v":0},{"$f":"Wniosek!I269","v":0}]
[{"$f":"Wniosek!A270","v":103},{"$f":"Wniosek!B270","v":""},{"$f":"Wniosek!C270","v":0},{"$f":"Wniosek!D270","v":0},{"$f":"Wniosek!E270","v":0},{"$f":"Wniosek!F270","v":0},{"$f":"Wniosek!G270","v":0},{"$f":"Wniosek!H270","v":0},{"$f":"Wniosek!I270","v":0}]
[{"$f":"Wniosek!A271","v":104},{"$f":"Wniosek!B271","v":""},{"$f":"Wniosek!C271","v":0},{"$f":"Wniosek!D271","v":0},{"$f":"Wniosek!E271","v":0},{"$f":"Wniosek!F271","v":0},{"$f":"Wniosek!G271","v":0},{"$f":"Wniosek!H271","v":0},{"$f":"Wniosek!I271","v":0}]
[{"$f":"Wniosek!A272","v":105},{"$f":"Wniosek!B272","v":""},{"$f":"Wniosek!C272","v":0},{"$f":"Wniosek!D272","v":0},{"$f":"Wniosek!E272","v":0},{"$f":"Wniosek!F272","v":0},{"$f":"Wniosek!G272","v":0},{"$f":"Wniosek!H272","v":0},{"$f":"Wniosek!I272","v":0}]
[{"$f":"Wniosek!A273","v":106},{"$f":"Wniosek!B273","v":""},{"$f":"Wniosek!C273","v":0},{"$f":"Wniosek!D273","v":0},{"$f":"Wniosek!E273","v":0},{"$f":"Wniosek!F273","v":0},{"$f":"Wniosek!G273","v":0},{"$f":"Wniosek!H273","v":0},{"$f":"Wniosek!I273","v":0}]
[{"$f":"Wniosek!A274","v":107},{"$f":"Wniosek!B274","v":""},{"$f":"Wniosek!C274","v":0},{"$f":"Wniosek!D274","v":0},{"$f":"Wniosek!E274","v":0},{"$f":"Wniosek!F274","v":0},{"$f":"Wniosek!G274","v":0},{"$f":"Wniosek!H274","v":0},{"$f":"Wniosek!I274","v":0}]
[{"$f":"Wniosek!A275","v":108},{"$f":"Wniosek!B275","v":""},{"$f":"Wniosek!C275","v":0},{"$f":"Wniosek!D275","v":0},{"$f":"Wniosek!E275","v":0},{"$f":"Wniosek!F275","v":0},{"$f":"Wniosek!G275","v":0},{"$f":"Wniosek!H275","v":0},{"$f":"Wniosek!I275","v":0}]
[{"$f":"Wniosek!A276","v":109},{"$f":"Wniosek!B276","v":""},{"$f":"Wniosek!C276","v":0},{"$f":"Wniosek!D276","v":0},{"$f":"Wniosek!E276","v":0},{"$f":"Wniosek!F276","v":0},{"$f":"Wniosek!G276","v":0},{"$f":"Wniosek!H276","v":0},{"$f":"Wniosek!I276","v":0}]
[{"$f":"Wniosek!A277","v":110},{"$f":"Wniosek!B277","v":""},{"$f":"Wniosek!C277","v":0},{"$f":"Wniosek!D277","v":0},{"$f":"Wniosek!E277","v":0},{"$f":"Wniosek!F277","v":0},{"$f":"Wniosek!G277","v":0},{"$f":"Wniosek!H277","v":0},{"$f":"Wniosek!I277","v":0}]
[{"$f":"Wniosek!A278","v":111},{"$f":"Wniosek!B278","v":""},{"$f":"Wniosek!C278","v":0},{"$f":"Wniosek!D278","v":0},{"$f":"Wniosek!E278","v":0},{"$f":"Wniosek!F278","v":0},{"$f":"Wniosek!G278","v":0},{"$f":"Wniosek!H278","v":0},{"$f":"Wniosek!I278","v":0}]
[{"$f":"Wniosek!A279","v":112},{"$f":"Wniosek!B279","v":""},{"$f":"Wniosek!C279","v":0},{"$f":"Wniosek!D279","v":0},{"$f":"Wniosek!E279","v":0},{"$f":"Wniosek!F279","v":0},{"$f":"Wniosek!G279","v":0},{"$f":"Wniosek!H279","v":0},{"$f":"Wniosek!I279","v":0}]
[{"$f":"Wniosek!A280","v":113},{"$f":"Wniosek!B280","v":""},{"$f":"Wniosek!C280","v":0},{"$f":"Wniosek!D280","v":0},{"$f":"Wniosek!E280","v":0},{"$f":"Wniosek!F280","v":0},{"$f":"Wniosek!G280","v":0},{"$f":"Wniosek!H280","v":0},{"$f":"Wniosek!I280","v":0}]
[{"$f":"Wniosek!A281","v":114},{"$f":"Wniosek!B281","v":""},{"$f":"Wniosek!C281","v":0},{"$f":"Wniosek!D281","v":0},{"$f":"Wniosek!E281","v":0},{"$f":"Wniosek!F281","v":0},{"$f":"Wniosek!G281","v":0},{"$f":"Wniosek!H281","v":0},{"$f":"Wniosek!I281","v":0}]
[{"$f":"Wniosek!A282","v":115},{"$f":"Wniosek!B282","v":""},{"$f":"Wniosek!C282","v":0},{"$f":"Wniosek!D282","v":0},{"$f":"Wniosek!E282","v":0},{"$f":"Wniosek!F282","v":0},{"$f":"Wniosek!G282","v":0},{"$f":"Wniosek!H282","v":0},{"$f":"Wniosek!I282","v":0}]

{"sheet":"Dane - linie (2)","index":8,"n_rows":116,"n_cols":9,"rows_kept":116,"cut":false,"hidden":true,"merged":[]}
[{"$f":"Wniosek!A166","v":"Lp."},{"$f":"Wniosek!B166","v":"Nazwa linii komunikacyjnej"},{"$f":"Wniosek!C166","v":"Przewidywana wielkość pracy eksploatacyjnej w okresie rozliczeniowym [wzkm]"},{"$f":"Wniosek!D166","v":"Cena usługi [zł]"},{"$f":"Wniosek!E166","v":"Planowany deficyt w okresie rozliczeniowym [zł]"},{"$f":"Wniosek!F166","v":"Część ceny usługi sfinansowana ze środków własnych organizatora \n[zł/wzkm]"},{"$f":"Wniosek!G166","v":"Procentowa wartość części ceny usługi sfinansowanej ze środków własnych organizatora [%]"},{"$f":"Wniosek!H166","v":"Kwota środków własnych organizatora [zł]"},{"$f":"Wniosek!I166","v":"Kwota dopłaty \nw okresie rozliczeniowym \n[zł]"}]
[{"$f":"Wniosek!A168","v":1},{"$f":"Wniosek!B289","v":""},{"$f":"Wniosek!C289","v":0},{"$f":"Wniosek!D289","v":0},{"$f":"Wniosek!E289","v":0},{"$f":"Wniosek!F289","v":0},{"$f":"Wniosek!G289","v":0},{"$f":"Wniosek!H289","v":0},{"$f":"Wniosek!I289","v":0}]
[{"$f":"Wniosek!A169","v":2},{"$f":"Wniosek!B290","v":""},{"$f":"Wniosek!C290","v":0},{"$f":"Wniosek!D290","v":0},{"$f":"Wniosek!E290","v":0},{"$f":"Wniosek!F290","v":0},{"$f":"Wniosek!G290","v":0},{"$f":"Wniosek!H290","v":0},{"$f":"Wniosek!I290","v":0}]
[{"$f":"Wniosek!A170","v":3},{"$f":"Wniosek!B291","v":""},{"$f":"Wniosek!C291","v":0},{"$f":"Wniosek!D291","v":0},{"$f":"Wniosek!E291","v":0},{"$f":"Wniosek!F291","v":0},{"$f":"Wniosek!G291","v":0},{"$f":"Wniosek!H291","v":0},{"$f":"Wniosek!I291","v":0}]
[{"$f":"Wniosek!A171","v":4},{"$f":"Wniosek!B292","v":""},{"$f":"Wniosek!C292","v":0},{"$f":"Wniosek!D292","v":0},{"$f":"Wniosek!E292","v":0},{"$f":"Wniosek!F292","v":0},{"$f":"Wniosek!G292","v":0},{"$f":"Wniosek!H292","v":0},{"$f":"Wniosek!I292","v":0}]
[{"$f":"Wniosek!A172","v":5},{"$f":"Wniosek!B293","v":""},{"$f":"Wniosek!C293","v":0},{"$f":"Wniosek!D293","v":0},{"$f":"Wniosek!E293","v":0},{"$f":"Wniosek!F293","v":0},{"$f":"Wniosek!G293","v":0},{"$f":"Wniosek!H293","v":0},{"$f":"Wniosek!I293","v":0}]
[{"$f":"Wniosek!A173","v":6},{"$f":"Wniosek!B294","v":""},{"$f":"Wniosek!C294","v":0},{"$f":"Wniosek!D294","v":0},{"$f":"Wniosek!E294","v":0},{"$f":"Wniosek!F294","v":0},{"$f":"Wniosek!G294","v":0},{"$f":"Wniosek!H294","v":0},{"$f":"Wniosek!I294","v":0}]
[{"$f":"Wniosek!A174","v":7},{"$f":"Wniosek!B295","v":""},{"$f":"Wniosek!C295","v":0},{"$f":"Wniosek!D295","v":0},{"$f":"Wniosek!E295","v":0},{"$f":"Wniosek!F295","v":0},{"$f":"Wniosek!G295","v":0},{"$f":"Wniosek!H295","v":0},{"$f":"Wniosek!I295","v":0}]
[{"$f":"Wniosek!A175","v":8},{"$f":"Wniosek!B296","v":""},{"$f":"Wniosek!C296","v":0},{"$f":"Wniosek!D296","v":0},{"$f":"Wniosek!E296","v":0},{"$f":"Wniosek!F296","v":0},{"$f":"Wniosek!G296","v":0},{"$f":"Wniosek!H296","v":0},{"$f":"Wniosek!I296","v":0}]
[{"$f":"Wniosek!A176","v":9},{"$f":"Wniosek!B297","v":""},{"$f":"Wniosek!C297","v":0},{"$f":"Wniosek!D297","v":0},{"$f":"Wniosek!E297","v":0},{"$f":"Wniosek!F297","v":0},{"$f":"Wniosek!G297","v":0},{"$f":"Wniosek!H297","v":0},{"$f":"Wniosek!I297","v":0}]
[{"$f":"Wniosek!A177","v":10},{"$f":"Wniosek!B298","v":""},{"$f":"Wniosek!C298","v":0},{"$f":"Wniosek!D298","v":0},{"$f":"Wniosek!E298","v":0},{"$f":"Wniosek!F298","v":0},{"$f":"Wniosek!G298","v":0},{"$f":"Wniosek!H298","v":0},{"$f":"Wniosek!I298","v":0}]
[{"$f":"Wniosek!A178","v":11},{"$f":"Wniosek!B299","v":""},{"$f":"Wniosek!C299","v":0},{"$f":"Wniosek!D299","v":0},{"$f":"Wniosek!E299","v":0},{"$f":"Wniosek!F299","v":0},{"$f":"Wniosek!G299","v":0},{"$f":"Wniosek!H299","v":0},{"$f":"Wniosek!I299","v":0}]
[{"$f":"Wniosek!A179","v":12},{"$f":"Wniosek!B300","v":""},{"$f":"Wniosek!C300","v":0},{"$f":"Wniosek!D300","v":0},{"$f":"Wniosek!E300","v":0},{"$f":"Wniosek!F300","v":0},{"$f":"Wniosek!G300","v":0},{"$f":"Wniosek!H300","v":0},{"$f":"Wniosek!I300","v":0}]
[{"$f":"Wniosek!A180","v":13},{"$f":"Wniosek!B301","v":""},{"$f":"Wniosek!C301","v":0},{"$f":"Wniosek!D301","v":0},{"$f":"Wniosek!E301","v":0},{"$f":"Wniosek!F301","v":0},{"$f":"Wniosek!G301","v":0},{"$f":"Wniosek!H301","v":0},{"$f":"Wniosek!I301","v":0}]
[{"$f":"Wniosek!A181","v":14},{"$f":"Wniosek!B302","v":""},{"$f":"Wniosek!C302","v":0},{"$f":"Wniosek!D302","v":0},{"$f":"Wniosek!E302","v":0},{"$f":"Wniosek!F302","v":0},{"$f":"Wniosek!G302","v":0},{"$f":"Wniosek!H302","v":0},{"$f":"Wniosek!I302","v":0}]
[{"$f":"Wniosek!A182","v":15},{"$f":"Wniosek!B303","v":""},{"$f":"Wniosek!C303","v":0},{"$f":"Wniosek!D303","v":0},{"$f":"Wniosek!E303","v":0},{"$f":"Wniosek!F303","v":0},{"$f":"Wniosek!G303","v":0},{"$f":"Wniosek!H303","v":0},{"$f":"Wniosek!I303","v":0}]
[{"$f":"Wniosek!A183","v":16},{"$f":"Wniosek!B304","v":""},{"$f":"Wniosek!C304","v":0},{"$f":"Wniosek!D304","v":0},{"$f":"Wniosek!E304","v":0},{"$f":"Wniosek!F304","v":0},{"$f":"Wniosek!G304","v":0},{"$f":"Wniosek!H304","v":0},{"$f":"Wniosek!I304","v":0}]
[{"$f":"Wniosek!A184","v":17},{"$f":"Wniosek!B305","v":""},{"$f":"Wniosek!C305","v":0},{"$f":"Wniosek!D305","v":0},{"$f":"Wniosek!E305","v":0},{"$f":"Wniosek!F305","v":0},{"$f":"Wniosek!G305","v":0},{"$f":"Wniosek!H305","v":0},{"$f":"Wniosek!I305","v":0}]
[{"$f":"Wniosek!A185","v":18},{"$f":"Wniosek!B306","v":""},{"$f":"Wniosek!C306","v":0},{"$f":"Wniosek!D306","v":0},{"$f":"Wniosek!E306","v":0},{"$f":"Wniosek!F306","v":0},{"$f":"Wniosek!G306","v":0},{"$f":"Wniosek!H306","v":0},{"$f":"Wniosek!I306","v":0}]
[{"$f":"Wniosek!A186","v":19},{"$f":"Wniosek!B307","v":""},{"$f":"Wniosek!C307","v":0},{"$f":"Wniosek!D307","v":0},{"$f":"Wniosek!E307","v":0},{"$f":"Wniosek!F307","v":0},{"$f":"Wniosek!G307","v":0},{"$f":"Wniosek!H307","v":0},{"$f":"Wniosek!I307","v":0}]
[{"$f":"Wniosek!A187","v":20},{"$f":"Wniosek!B308","v":""},{"$f":"Wniosek!C308","v":0},{"$f":"Wniosek!D308","v":0},{"$f":"Wniosek!E308","v":0},{"$f":"Wniosek!F308","v":0},{"$f":"Wniosek!G308","v":0},{"$f":"Wniosek!H308","v":0},{"$f":"Wniosek!I308","v":0}]
[{"$f":"Wniosek!A188","v":21},{"$f":"Wniosek!B309","v":""},{"$f":"Wniosek!C309","v":0},{"$f":"Wniosek!D309","v":0},{"$f":"Wniosek!E309","v":0},{"$f":"Wniosek!F309","v":0},{"$f":"Wniosek!G309","v":0},{"$f":"Wniosek!H309","v":0},{"$f":"Wniosek!I309","v":0}]
[{"$f":"Wniosek!A189","v":22},{"$f":"Wniosek!B310","v":""},{"$f":"Wniosek!C310","v":0},{"$f":"Wniosek!D310","v":0},{"$f":"Wniosek!E310","v":0},{"$f":"Wniosek!F310","v":0},{"$f":"Wniosek!G310","v":0},{"$f":"Wniosek!H310","v":0},{"$f":"Wniosek!I310","v":0}]
[{"$f":"Wniosek!A190","v":23},{"$f":"Wniosek!B311","v":""},{"$f":"Wniosek!C311","v":0},{"$f":"Wniosek!D311","v":0},{"$f":"Wniosek!E311","v":0},{"$f":"Wniosek!F311","v":0},{"$f":"Wniosek!G311","v":0},{"$f":"Wniosek!H311","v":0},{"$f":"Wniosek!I311","v":0}]
[{"$f":"Wniosek!A191","v":24},{"$f":"Wniosek!B312","v":""},{"$f":"Wniosek!C312","v":0},{"$f":"Wniosek!D312","v":0},{"$f":"Wniosek!E312","v":0},{"$f":"Wniosek!F312","v":0},{"$f":"Wniosek!G312","v":0},{"$f":"Wniosek!H312","v":0},{"$f":"Wniosek!I312","v":0}]
[{"$f":"Wniosek!A192","v":25},{"$f":"Wniosek!B313","v":""},{"$f":"Wniosek!C313","v":0},{"$f":"Wniosek!D313","v":0},{"$f":"Wniosek!E313","v":0},{"$f":"Wniosek!F313","v":0},{"$f":"Wniosek!G313","v":0},{"$f":"Wniosek!H313","v":0},{"$f":"Wniosek!I313","v":0}]
[{"$f":"Wniosek!A193","v":26},{"$f":"Wniosek!B314","v":""},{"$f":"Wniosek!C314","v":0},{"$f":"Wniosek!D314","v":0},{"$f":"Wniosek!E314","v":0},{"$f":"Wniosek!F314","v":0},{"$f":"Wniosek!G314","v":0},{"$f":"Wniosek!H314","v":0},{"$f":"Wniosek!I314","v":0}]
[{"$f":"Wniosek!A194","v":27},{"$f":"Wniosek!B315","v":""},{"$f":"Wniosek!C315","v":0},{"$f":"Wniosek!D315","v":0},{"$f":"Wniosek!E315","v":0},{"$f":"Wniosek!F315","v":0},{"$f":"Wniosek!G315","v":0},{"$f":"Wniosek!H315","v":0},{"$f":"Wniosek!I315","v":0}]
[{"$f":"Wniosek!A195","v":28},{"$f":"Wniosek!B316","v":""},{"$f":"Wniosek!C316","v":0},{"$f":"Wniosek!D316","v":0},{"$f":"Wniosek!E316","v":0},{"$f":"Wniosek!F316","v":0},{"$f":"Wniosek!G316","v":0},{"$f":"Wniosek!H316","v":0},{"$f":"Wniosek!I316","v":0}]
[{"$f":"Wniosek!A196","v":29},{"$f":"Wniosek!B317","v":""},{"$f":"Wniosek!C317","v":0},{"$f":"Wniosek!D317","v":0},{"$f":"Wniosek!E317","v":0},{"$f":"Wniosek!F317","v":0},{"$f":"Wniosek!G317","v":0},{"$f":"Wniosek!H317","v":0},{"$f":"Wniosek!I317","v":0}]
[{"$f":"Wniosek!A197","v":30},{"$f":"Wniosek!B318","v":""},{"$f":"Wniosek!C318","v":0},{"$f":"Wniosek!D318","v":0},{"$f":"Wniosek!E318","v":0},{"$f":"Wniosek!F318","v":0},{"$f":"Wniosek!G318","v":0},{"$f":"Wniosek!H318","v":0},{"$f":"Wniosek!I318","v":0}]
[{"$f":"Wniosek!A198","v":31},{"$f":"Wniosek!B319","v":""},{"$f":"Wniosek!C319","v":0},{"$f":"Wniosek!D319","v":0},{"$f":"Wniosek!E319","v":0},{"$f":"Wniosek!F319","v":0},{"$f":"Wniosek!G319","v":0},{"$f":"Wniosek!H319","v":0},{"$f":"Wniosek!I319","v":0}]
[{"$f":"Wniosek!A199","v":32},{"$f":"Wniosek!B320","v":""},{"$f":"Wniosek!C320","v":0},{"$f":"Wniosek!D320","v":0},{"$f":"Wniosek!E320","v":0},{"$f":"Wniosek!F320","v":0},{"$f":"Wniosek!G320","v":0},{"$f":"Wniosek!H320","v":0},{"$f":"Wniosek!I320","v":0}]
[{"$f":"Wniosek!A200","v":33},{"$f":"Wniosek!B321","v":""},{"$f":"Wniosek!C321","v":0},{"$f":"Wniosek!D321","v":0},{"$f":"Wniosek!E321","v":0},{"$f":"Wniosek!F321","v":0},{"$f":"Wniosek!G321","v":0},{"$f":"Wniosek!H321","v":0},{"$f":"Wniosek!I321","v":0}]
[{"$f":"Wniosek!A201","v":34},{"$f":"Wniosek!B322","v":""},{"$f":"Wniosek!C322","v":0},{"$f":"Wniosek!D322","v":0},{"$f":"Wniosek!E322","v":0},{"$f":"Wniosek!F322","v":0},{"$f":"Wniosek!G322","v":0},{"$f":"Wniosek!H322","v":0},{"$f":"Wniosek!I322","v":0}]
[{"$f":"Wniosek!A202","v":35},{"$f":"Wniosek!B323","v":""},{"$f":"Wniosek!C323","v":0},{"$f":"Wniosek!D323","v":0},{"$f":"Wniosek!E323","v":0},{"$f":"Wniosek!F323","v":0},{"$f":"Wniosek!G323","v":0},{"$f":"Wniosek!H323","v":0},{"$f":"Wniosek!I323","v":0}]
[{"$f":"Wniosek!A203","v":36},{"$f":"Wniosek!B324","v":""},{"$f":"Wniosek!C324","v":0},{"$f":"Wniosek!D324","v":0},{"$f":"Wniosek!E324","v":0},{"$f":"Wniosek!F324","v":0},{"$f":"Wniosek!G324","v":0},{"$f":"Wniosek!H324","v":0},{"$f":"Wniosek!I324","v":0}]
[{"$f":"Wniosek!A204","v":37},{"$f":"Wniosek!B325","v":""},{"$f":"Wniosek!C325","v":0},{"$f":"Wniosek!D325","v":0},{"$f":"Wniosek!E325","v":0},{"$f":"Wniosek!F325","v":0},{"$f":"Wniosek!G325","v":0},{"$f":"Wniosek!H325","v":0},{"$f":"Wniosek!I325","v":0}]
[{"$f":"Wniosek!A205","v":38},{"$f":"Wniosek!B326","v":""},{"$f":"Wniosek!C326","v":0},{"$f":"Wniosek!D326","v":0},{"$f":"Wniosek!E326","v":0},{"$f":"Wniosek!F326","v":0},{"$f":"Wniosek!G326","v":0},{"$f":"Wniosek!H326","v":0},{"$f":"Wniosek!I326","v":0}]
[{"$f":"Wniosek!A206","v":39},{"$f":"Wniosek!B327","v":""},{"$f":"Wniosek!C327","v":0},{"$f":"Wniosek!D327","v":0},{"$f":"Wniosek!E327","v":0},{"$f":"Wniosek!F327","v":0},{"$f":"Wniosek!G327","v":0},{"$f":"Wniosek!H327","v":0},{"$f":"Wniosek!I327","v":0}]
[{"$f":"Wniosek!A207","v":40},{"$f":"Wniosek!B328","v":""},{"$f":"Wniosek!C328","v":0},{"$f":"Wniosek!D328","v":0},{"$f":"Wniosek!E328","v":0},{"$f":"Wniosek!F328","v":0},{"$f":"Wniosek!G328","v":0},{"$f":"Wniosek!H328","v":0},{"$f":"Wniosek!I328","v":0}]
[{"$f":"Wniosek!A208","v":41},{"$f":"Wniosek!B329","v":""},{"$f":"Wniosek!C329","v":0},{"$f":"Wniosek!D329","v":0},{"$f":"Wniosek!E329","v":0},{"$f":"Wniosek!F329","v":0},{"$f":"Wniosek!G329","v":0},{"$f":"Wniosek!H329","v":0},{"$f":"Wniosek!I329","v":0}]
[{"$f":"Wniosek!A209","v":42},{"$f":"Wniosek!B330","v":""},{"$f":"Wniosek!C330","v":0},{"$f":"Wniosek!D330","v":0},{"$f":"Wniosek!E330","v":0},{"$f":"Wniosek!F330","v":0},{"$f":"Wniosek!G330","v":0},{"$f":"Wniosek!H330","v":0},{"$f":"Wniosek!I330","v":0}]
[{"$f":"Wniosek!A210","v":43},{"$f":"Wniosek!B331","v":""},{"$f":"Wniosek!C331","v":0},{"$f":"Wniosek!D331","v":0},{"$f":"Wniosek!E331","v":0},{"$f":"Wniosek!F331","v":0},{"$f":"Wniosek!G331","v":0},{"$f":"Wniosek!H331","v":0},{"$f":"Wniosek!I331","v":0}]
[{"$f":"Wniosek!A211","v":44},{"$f":"Wniosek!B332","v":""},{"$f":"Wniosek!C332","v":0},{"$f":"Wniosek!D332","v":0},{"$f":"Wniosek!E332","v":0},{"$f":"Wniosek!F332","v":0},{"$f":"Wniosek!G332","v":0},{"$f":"Wniosek!H332","v":0},{"$f":"Wniosek!I332","v":0}]
[{"$f":"Wniosek!A212","v":45},{"$f":"Wniosek!B333","v":""},{"$f":"Wniosek!C333","v":0},{"$f":"Wniosek!D333","v":0},{"$f":"Wniosek!E333","v":0},{"$f":"Wniosek!F333","v":0},{"$f":"Wniosek!G333","v":0},{"$f":"Wniosek!H333","v":0},{"$f":"Wniosek!I333","v":0}]
[{"$f":"Wniosek!A213","v":46},{"$f":"Wniosek!B334","v":""},{"$f":"Wniosek!C334","v":0},{"$f":"Wniosek!D334","v":0},{"$f":"Wniosek!E334","v":0},{"$f":"Wniosek!F334","v":0},{"$f":"Wniosek!G334","v":0},{"$f":"Wniosek!H334","v":0},{"$f":"Wniosek!I334","v":0}]
[{"$f":"Wniosek!A214","v":47},{"$f":"Wniosek!B335","v":""},{"$f":"Wniosek!C335","v":0},{"$f":"Wniosek!D335","v":0},{"$f":"Wniosek!E335","v":0},{"$f":"Wniosek!F335","v":0},{"$f":"Wniosek!G335","v":0},{"$f":"Wniosek!H335","v":0},{"$f":"Wniosek!I335","v":0}]
[{"$f":"Wniosek!A215","v":48},{"$f":"Wniosek!B336","v":""},{"$f":"Wniosek!C336","v":0},{"$f":"Wniosek!D336","v":0},{"$f":"Wniosek!E336","v":0},{"$f":"Wniosek!F336","v":0},{"$f":"Wniosek!G336","v":0},{"$f":"Wniosek!H336","v":0},{"$f":"Wniosek!I336","v":0}]
[{"$f":"Wniosek!A216","v":49},{"$f":"Wniosek!B337","v":""},{"$f":"Wniosek!C337","v":0},{"$f":"Wniosek!D337","v":0},{"$f":"Wniosek!E337","v":0},{"$f":"Wniosek!F337","v":0},{"$f":"Wniosek!G337","v":0},{"$f":"Wniosek!H337","v":0},{"$f":"Wniosek!I337","v":0}]
[{"$f":"Wniosek!A217","v":50},{"$f":"Wniosek!B338","v":""},{"$f":"Wniosek!C338","v":0},{"$f":"Wniosek!D338","v":0},{"$f":"Wniosek!E338","v":0},{"$f":"Wniosek!F338","v":0},{"$f":"Wniosek!G338","v":0},{"$f":"Wniosek!H338","v":0},{"$f":"Wniosek!I338","v":0}]
[{"$f":"Wniosek!A218","v":51},{"$f":"Wniosek!B339","v":""},{"$f":"Wniosek!C339","v":0},{"$f":"Wniosek!D339","v":0},{"$f":"Wniosek!E339","v":0},{"$f":"Wniosek!F339","v":0},{"$f":"Wniosek!G339","v":0},{"$f":"Wniosek!H339","v":0},{"$f":"Wniosek!I339","v":0}]
[{"$f":"Wniosek!A219","v":52},{"$f":"Wniosek!B340","v":""},{"$f":"Wniosek!C340","v":0},{"$f":"Wniosek!D340","v":0},{"$f":"Wniosek!E340","v":0},{"$f":"Wniosek!F340","v":0},{"$f":"Wniosek!G340","v":0},{"$f":"Wniosek!H340","v":0},{"$f":"Wniosek!I340","v":0}]
[{"$f":"Wniosek!A220","v":53},{"$f":"Wniosek!B341","v":""},{"$f":"Wniosek!C341","v":0},{"$f":"Wniosek!D341","v":0},{"$f":"Wniosek!E341","v":0},{"$f":"Wniosek!F341","v":0},{"$f":"Wniosek!G341","v":0},{"$f":"Wniosek!H341","v":0},{"$f":"Wniosek!I341","v":0}]
[{"$f":"Wniosek!A221","v":54},{"$f":"Wniosek!B342","v":""},{"$f":"Wniosek!C342","v":0},{"$f":"Wniosek!D342","v":0},{"$f":"Wniosek!E342","v":0},{"$f":"Wniosek!F342","v":0},{"$f":"Wniosek!G342","v":0},{"$f":"Wniosek!H342","v":0},{"$f":"Wniosek!I342","v":0}]
[{"$f":"Wniosek!A222","v":55},{"$f":"Wniosek!B343","v":""},{"$f":"Wniosek!C343","v":0},{"$f":"Wniosek!D343","v":0},{"$f":"Wniosek!E343","v":0},{"$f":"Wniosek!F343","v":0},{"$f":"Wniosek!G343","v":0},{"$f":"Wniosek!H343","v":0},{"$f":"Wniosek!I343","v":0}]
[{"$f":"Wniosek!A223","v":56},{"$f":"Wniosek!B344","v":""},{"$f":"Wniosek!C344","v":0},{"$f":"Wniosek!D344","v":0},{"$f":"Wniosek!E344","v":0},{"$f":"Wniosek!F344","v":0},{"$f":"Wniosek!G344","v":0},{"$f":"Wniosek!H344","v":0},{"$f":"Wniosek!I344","v":0}]
[{"$f":"Wniosek!A224","v":57},{"$f":"Wniosek!B345","v":""},{"$f":"Wniosek!C345","v":0},{"$f":"Wniosek!D345","v":0},{"$f":"Wniosek!E345","v":0},{"$f":"Wniosek!F345","v":0},{"$f":"Wniosek!G345","v":0},{"$f":"Wniosek!H345","v":0},{"$f":"Wniosek!I345","v":0}]
[{"$f":"Wniosek!A225","v":58},{"$f":"Wniosek!B346","v":""},{"$f":"Wniosek!C346","v":0},{"$f":"Wniosek!D346","v":0},{"$f":"Wniosek!E346","v":0},{"$f":"Wniosek!F346","v":0},{"$f":"Wniosek!G346","v":0},{"$f":"Wniosek!H346","v":0},{"$f":"Wniosek!I346","v":0}]
[{"$f":"Wniosek!A226","v":59},{"$f":"Wniosek!B347","v":""},{"$f":"Wniosek!C347","v":0},{"$f":"Wniosek!D347","v":0},{"$f":"Wniosek!E347","v":0},{"$f":"Wniosek!F347","v":0},{"$f":"Wniosek!G347","v":0},{"$f":"Wniosek!H347","v":0},{"$f":"Wniosek!I347","v":0}]
[{"$f":"Wniosek!A227","v":60},{"$f":"Wniosek!B348","v":""},{"$f":"Wniosek!C348","v":0},{"$f":"Wniosek!D348","v":0},{"$f":"Wniosek!E348","v":0},{"$f":"Wniosek!F348","v":0},{"$f":"Wniosek!G348","v":0},{"$f":"Wniosek!H348","v":0},{"$f":"Wniosek!I348","v":0}]
[{"$f":"Wniosek!A228","v":61},{"$f":"Wniosek!B349","v":""},{"$f":"Wniosek!C349","v":0},{"$f":"Wniosek!D349","v":0},{"$f":"Wniosek!E349","v":0},{"$f":"Wniosek!F349","v":0},{"$f":"Wniosek!G349","v":0},{"$f":"Wniosek!H349","v":0},{"$f":"Wniosek!I349","v":0}]
[{"$f":"Wniosek!A229","v":62},{"$f":"Wniosek!B350","v":""},{"$f":"Wniosek!C350","v":0},{"$f":"Wniosek!D350","v":0},{"$f":"Wniosek!E350","v":0},{"$f":"Wniosek!F350","v":0},{"$f":"Wniosek!G350","v":0},{"$f":"Wniosek!H350","v":0},{"$f":"Wniosek!I350","v":0}]
[{"$f":"Wniosek!A230","v":63},{"$f":"Wniosek!B351","v":""},{"$f":"Wniosek!C351","v":0},{"$f":"Wniosek!D351","v":0},{"$f":"Wniosek!E351","v":0},{"$f":"Wniosek!F351","v":0},{"$f":"Wniosek!G351","v":0},{"$f":"Wniosek!H351","v":0},{"$f":"Wniosek!I351","v":0}]
[{"$f":"Wniosek!A231","v":64},{"$f":"Wniosek!B352","v":""},{"$f":"Wniosek!C352","v":0},{"$f":"Wniosek!D352","v":0},{"$f":"Wniosek!E352","v":0},{"$f":"Wniosek!F352","v":0},{"$f":"Wniosek!G352","v":0},{"$f":"Wniosek!H352","v":0},{"$f":"Wniosek!I352","v":0}]
[{"$f":"Wniosek!A232","v":65},{"$f":"Wniosek!B353","v":""},{"$f":"Wniosek!C353","v":0},{"$f":"Wniosek!D353","v":0},{"$f":"Wniosek!E353","v":0},{"$f":"Wniosek!F353","v":0},{"$f":"Wniosek!G353","v":0},{"$f":"Wniosek!H353","v":0},{"$f":"Wniosek!I353","v":0}]
[{"$f":"Wniosek!A233","v":66},{"$f":"Wniosek!B354","v":""},{"$f":"Wniosek!C354","v":0},{"$f":"Wniosek!D354","v":0},{"$f":"Wniosek!E354","v":0},{"$f":"Wniosek!F354","v":0},{"$f":"Wniosek!G354","v":0},{"$f":"Wniosek!H354","v":0},{"$f":"Wniosek!I354","v":0}]
[{"$f":"Wniosek!A234","v":67},{"$f":"Wniosek!B355","v":""},{"$f":"Wniosek!C355","v":0},{"$f":"Wniosek!D355","v":0},{"$f":"Wniosek!E355","v":0},{"$f":"Wniosek!F355","v":0},{"$f":"Wniosek!G355","v":0},{"$f":"Wniosek!H355","v":0},{"$f":"Wniosek!I355","v":0}]
[{"$f":"Wniosek!A235","v":68},{"$f":"Wniosek!B356","v":""},{"$f":"Wniosek!C356","v":0},{"$f":"Wniosek!D356","v":0},{"$f":"Wniosek!E356","v":0},{"$f":"Wniosek!F356","v":0},{"$f":"Wniosek!G356","v":0},{"$f":"Wniosek!H356","v":0},{"$f":"Wniosek!I356","v":0}]
[{"$f":"Wniosek!A236","v":69},{"$f":"Wniosek!B357","v":""},{"$f":"Wniosek!C357","v":0},{"$f":"Wniosek!D357","v":0},{"$f":"Wniosek!E357","v":0},{"$f":"Wniosek!F357","v":0},{"$f":"Wniosek!G357","v":0},{"$f":"Wniosek!H357","v":0},{"$f":"Wniosek!I357","v":0}]
[{"$f":"Wniosek!A237","v":70},{"$f":"Wniosek!B358","v":""},{"$f":"Wniosek!C358","v":0},{"$f":"Wniosek!D358","v":0},{"$f":"Wniosek!E358","v":0},{"$f":"Wniosek!F358","v":0},{"$f":"Wniosek!G358","v":0},{"$f":"Wniosek!H358","v":0},{"$f":"Wniosek!I358","v":0}]
[{"$f":"Wniosek!A238","v":71},{"$f":"Wniosek!B359","v":""},{"$f":"Wniosek!C359","v":0},{"$f":"Wniosek!D359","v":0},{"$f":"Wniosek!E359","v":0},{"$f":"Wniosek!F359","v":0},{"$f":"Wniosek!G359","v":0},{"$f":"Wniosek!H359","v":0},{"$f":"Wniosek!I359","v":0}]
[{"$f":"Wniosek!A239","v":72},{"$f":"Wniosek!B360","v":""},{"$f":"Wniosek!C360","v":0},{"$f":"Wniosek!D360","v":0},{"$f":"Wniosek!E360","v":0},{"$f":"Wniosek!F360","v":0},{"$f":"Wniosek!G360","v":0},{"$f":"Wniosek!H360","v":0},{"$f":"Wniosek!I360","v":0}]
[{"$f":"Wniosek!A240","v":73},{"$f":"Wniosek!B361","v":""},{"$f":"Wniosek!C361","v":0},{"$f":"Wniosek!D361","v":0},{"$f":"Wniosek!E361","v":0},{"$f":"Wniosek!F361","v":0},{"$f":"Wniosek!G361","v":0},{"$f":"Wniosek!H361","v":0},{"$f":"Wniosek!I361","v":0}]
[{"$f":"Wniosek!A241","v":74},{"$f":"Wniosek!B362","v":""},{"$f":"Wniosek!C362","v":0},{"$f":"Wniosek!D362","v":0},{"$f":"Wniosek!E362","v":0},{"$f":"Wniosek!F362","v":0},{"$f":"Wniosek!G362","v":0},{"$f":"Wniosek!H362","v":0},{"$f":"Wniosek!I362","v":0}]
[{"$f":"Wniosek!A242","v":75},{"$f":"Wniosek!B363","v":""},{"$f":"Wniosek!C363","v":0},{"$f":"Wniosek!D363","v":0},{"$f":"Wniosek!E363","v":0},{"$f":"Wniosek!F363","v":0},{"$f":"Wniosek!G363","v":0},{"$f":"Wniosek!H363","v":0},{"$f":"Wniosek!I363","v":0}]
[{"$f":"Wniosek!A243","v":76},{"$f":"Wniosek!B364","v":""},{"$f":"Wniosek!C364","v":0},{"$f":"Wniosek!D364","v":0},{"$f":"Wniosek!E364","v":0},{"$f":"Wniosek!F364","v":0},{"$f":"Wniosek!G364","v":0},{"$f":"Wniosek!H364","v":0},{"$f":"Wniosek!I364","v":0}]
[{"$f":"Wniosek!A244","v":77},{"$f":"Wniosek!B365","v":""},{"$f":"Wniosek!C365","v":0},{"$f":"Wniosek!D365","v":0},{"$f":"Wniosek!E365","v":0},{"$f":"Wniosek!F365","v":0},{"$f":"Wniosek!G365","v":0},{"$f":"Wniosek!H365","v":0},{"$f":"Wniosek!I365","v":0}]
[{"$f":"Wniosek!A245","v":78},{"$f":"Wniosek!B366","v":""},{"$f":"Wniosek!C366","v":0},{"$f":"Wniosek!D366","v":0},{"$f":"Wniosek!E366","v":0},{"$f":"Wniosek!F366","v":0},{"$f":"Wniosek!G366","v":0},{"$f":"Wniosek!H366","v":0},{"$f":"Wniosek!I366","v":0}]
[{"$f":"Wniosek!A246","v":79},{"$f":"Wniosek!B367","v":""},{"$f":"Wniosek!C367","v":0},{"$f":"Wniosek!D367","v":0},{"$f":"Wniosek!E367","v":0},{"$f":"Wniosek!F367","v":0},{"$f":"Wniosek!G367","v":0},{"$f":"Wniosek!H367","v":0},{"$f":"Wniosek!I367","v":0}]
[{"$f":"Wniosek!A247","v":80},{"$f":"Wniosek!B368","v":""},{"$f":"Wniosek!C368","v":0},{"$f":"Wniosek!D368","v":0},{"$f":"Wniosek!E368","v":0},{"$f":"Wniosek!F368","v":0},{"$f":"Wniosek!G368","v":0},{"$f":"Wniosek!H368","v":0},{"$f":"Wniosek!I368","v":0}]
[{"$f":"Wniosek!A248","v":81},{"$f":"Wniosek!B369","v":""},{"$f":"Wniosek!C369","v":0},{"$f":"Wniosek!D369","v":0},{"$f":"Wniosek!E369","v":0},{"$f":"Wniosek!F369","v":0},{"$f":"Wniosek!G369","v":0},{"$f":"Wniosek!H369","v":0},{"$f":"Wniosek!I369","v":0}]
[{"$f":"Wniosek!A249","v":82},{"$f":"Wniosek!B370","v":""},{"$f":"Wniosek!C370","v":0},{"$f":"Wniosek!D370","v":0},{"$f":"Wniosek!E370","v":0},{"$f":"Wniosek!F370","v":0},{"$f":"Wniosek!G370","v":0},{"$f":"Wniosek!H370","v":0},{"$f":"Wniosek!I370","v":0}]
[{"$f":"Wniosek!A250","v":83},{"$f":"Wniosek!B371","v":""},{"$f":"Wniosek!C371","v":0},{"$f":"Wniosek!D371","v":0},{"$f":"Wniosek!E371","v":0},{"$f":"Wniosek!F371","v":0},{"$f":"Wniosek!G371","v":0},{"$f":"Wniosek!H371","v":0},{"$f":"Wniosek!I371","v":0}]
[{"$f":"Wniosek!A251","v":84},{"$f":"Wniosek!B372","v":""},{"$f":"Wniosek!C372","v":0},{"$f":"Wniosek!D372","v":0},{"$f":"Wniosek!E372","v":0},{"$f":"Wniosek!F372","v":0},{"$f":"Wniosek!G372","v":0},{"$f":"Wniosek!H372","v":0},{"$f":"Wniosek!I372","v":0}]
[{"$f":"Wniosek!A252","v":85},{"$f":"Wniosek!B373","v":""},{"$f":"Wniosek!C373","v":0},{"$f":"Wniosek!D373","v":0},{"$f":"Wniosek!E373","v":0},{"$f":"Wniosek!F373","v":0},{"$f":"Wniosek!G373","v":0},{"$f":"Wniosek!H373","v":0},{"$f":"Wniosek!I373","v":0}]
[{"$f":"Wniosek!A253","v":86},{"$f":"Wniosek!B374","v":""},{"$f":"Wniosek!C374","v":0},{"$f":"Wniosek!D374","v":0},{"$f":"Wniosek!E374","v":0},{"$f":"Wniosek!F374","v":0},{"$f":"Wniosek!G374","v":0},{"$f":"Wniosek!H374","v":0},{"$f":"Wniosek!I374","v":0}]
[{"$f":"Wniosek!A254","v":87},{"$f":"Wniosek!B375","v":""},{"$f":"Wniosek!C375","v":0},{"$f":"Wniosek!D375","v":0},{"$f":"Wniosek!E375","v":0},{"$f":"Wniosek!F375","v":0},{"$f":"Wniosek!G375","v":0},{"$f":"Wniosek!H375","v":0},{"$f":"Wniosek!I375","v":0}]
[{"$f":"Wniosek!A255","v":88},{"$f":"Wniosek!B376","v":""},{"$f":"Wniosek!C376","v":0},{"$f":"Wniosek!D376","v":0},{"$f":"Wniosek!E376","v":0},{"$f":"Wniosek!F376","v":0},{"$f":"Wniosek!G376","v":0},{"$f":"Wniosek!H376","v":0},{"$f":"Wniosek!I376","v":0}]
[{"$f":"Wniosek!A256","v":89},{"$f":"Wniosek!B377","v":""},{"$f":"Wniosek!C377","v":0},{"$f":"Wniosek!D377","v":0},{"$f":"Wniosek!E377","v":0},{"$f":"Wniosek!F377","v":0},{"$f":"Wniosek!G377","v":0},{"$f":"Wniosek!H377","v":0},{"$f":"Wniosek!I377","v":0}]
[{"$f":"Wniosek!A257","v":90},{"$f":"Wniosek!B378","v":""},{"$f":"Wniosek!C378","v":0},{"$f":"Wniosek!D378","v":0},{"$f":"Wniosek!E378","v":0},{"$f":"Wniosek!F378","v":0},{"$f":"Wniosek!G378","v":0},{"$f":"Wniosek!H378","v":0},{"$f":"Wniosek!I378","v":0}]
[{"$f":"Wniosek!A258","v":91},{"$f":"Wniosek!B379","v":""},{"$f":"Wniosek!C379","v":0},{"$f":"Wniosek!D379","v":0},{"$f":"Wniosek!E379","v":0},{"$f":"Wniosek!F379","v":0},{"$f":"Wniosek!G379","v":0},{"$f":"Wniosek!H379","v":0},{"$f":"Wniosek!I379","v":0}]
[{"$f":"Wniosek!A259","v":92},{"$f":"Wniosek!B380","v":""},{"$f":"Wniosek!C380","v":0},{"$f":"Wniosek!D380","v":0},{"$f":"Wniosek!E380","v":0},{"$f":"Wniosek!F380","v":0},{"$f":"Wniosek!G380","v":0},{"$f":"Wniosek!H380","v":0},{"$f":"Wniosek!I380","v":0}]
[{"$f":"Wniosek!A260","v":93},{"$f":"Wniosek!B381","v":""},{"$f":"Wniosek!C381","v":0},{"$f":"Wniosek!D381","v":0},{"$f":"Wniosek!E381","v":0},{"$f":"Wniosek!F381","v":0},{"$f":"Wniosek!G381","v":0},{"$f":"Wniosek!H381","v":0},{"$f":"Wniosek!I381","v":0}]
[{"$f":"Wniosek!A261","v":94},{"$f":"Wniosek!B382","v":""},{"$f":"Wniosek!C382","v":0},{"$f":"Wniosek!D382","v":0},{"$f":"Wniosek!E382","v":0},{"$f":"Wniosek!F382","v":0},{"$f":"Wniosek!G382","v":0},{"$f":"Wniosek!H382","v":0},{"$f":"Wniosek!I382","v":0}]
[{"$f":"Wniosek!A262","v":95},{"$f":"Wniosek!B383","v":""},{"$f":"Wniosek!C383","v":0},{"$f":"Wniosek!D383","v":0},{"$f":"Wniosek!E383","v":0},{"$f":"Wniosek!F383","v":0},{"$f":"Wniosek!G383","v":0},{"$f":"Wniosek!H383","v":0},{"$f":"Wniosek!I383","v":0}]
[{"$f":"Wniosek!A263","v":96},{"$f":"Wniosek!B384","v":""},{"$f":"Wniosek!C384","v":0},{"$f":"Wniosek!D384","v":0},{"$f":"Wniosek!E384","v":0},{"$f":"Wniosek!F384","v":0},{"$f":"Wniosek!G384","v":0},{"$f":"Wniosek!H384","v":0},{"$f":"Wniosek!I384","v":0}]
[{"$f":"Wniosek!A264","v":97},{"$f":"Wniosek!B385","v":""},{"$f":"Wniosek!C385","v":0},{"$f":"Wniosek!D385","v":0},{"$f":"Wniosek!E385","v":0},{"$f":"Wniosek!F385","v":0},{"$f":"Wniosek!G385","v":0},{"$f":"Wniosek!H385","v":0},{"$f":"Wniosek!I385","v":0}]
[{"$f":"Wniosek!A265","v":98},{"$f":"Wniosek!B386","v":""},{"$f":"Wniosek!C386","v":0},{"$f":"Wniosek!D386","v":0},{"$f":"Wniosek!E386","v":0},{"$f":"Wniosek!F386","v":0},{"$f":"Wniosek!G386","v":0},{"$f":"Wniosek!H386","v":0},{"$f":"Wniosek!I386","v":0}]
[{"$f":"Wniosek!A266","v":99},{"$f":"Wniosek!B387","v":""},{"$f":"Wniosek!C387","v":0},{"$f":"Wniosek!D387","v":0},{"$f":"Wniosek!E387","v":0},{"$f":"Wniosek!F387","v":0},{"$f":"Wniosek!G387","v":0},{"$f":"Wniosek!H387","v":0},{"$f":"Wniosek!I387","v":0}]
[{"$f":"Wniosek!A267","v":100},{"$f":"Wniosek!B388","v":""},{"$f":"Wniosek!C388","v":0},{"$f":"Wniosek!D388","v":0},{"$f":"Wniosek!E388","v":0},{"$f":"Wniosek!F388","v":0},{"$f":"Wniosek!G388","v":0},{"$f":"Wniosek!H388","v":0},{"$f":"Wniosek!I388","v":0}]
[{"$f":"Wniosek!A268","v":101},{"$f":"Wniosek!B389","v":""},{"$f":"Wniosek!C389","v":0},{"$f":"Wniosek!D389","v":0},{"$f":"Wniosek!E389","v":0},{"$f":"Wniosek!F389","v":0},{"$f":"Wniosek!G389","v":0},{"$f":"Wniosek!H389","v":0},{"$f":"Wniosek!I389","v":0}]
[{"$f":"Wniosek!A269","v":102},{"$f":"Wniosek!B390","v":""},{"$f":"Wniosek!C390","v":0},{"$f":"Wniosek!D390","v":0},{"$f":"Wniosek!E390","v":0},{"$f":"Wniosek!F390","v":0},{"$f":"Wniosek!G390","v":0},{"$f":"Wniosek!H390","v":0},{"$f":"Wniosek!I390","v":0}]
[{"$f":"Wniosek!A270","v":103},{"$f":"Wniosek!B391","v":""},{"$f":"Wniosek!C391","v":0},{"$f":"Wniosek!D391","v":0},{"$f":"Wniosek!E391","v":0},{"$f":"Wniosek!F391","v":0},{"$f":"Wniosek!G391","v":0},{"$f":"Wniosek!H391","v":0},{"$f":"Wniosek!I391","v":0}]
[{"$f":"Wniosek!A271","v":104},{"$f":"Wniosek!B392","v":""},{"$f":"Wniosek!C392","v":0},{"$f":"Wniosek!D392","v":0},{"$f":"Wniosek!E392","v":0},{"$f":"Wniosek!F392","v":0},{"$f":"Wniosek!G392","v":0},{"$f":"Wniosek!H392","v":0},{"$f":"Wniosek!I392","v":0}]
[{"$f":"Wniosek!A272","v":105},{"$f":"Wniosek!B393","v":""},{"$f":"Wniosek!C393","v":0},{"$f":"Wniosek!D393","v":0},{"$f":"Wniosek!E393","v":0},{"$f":"Wniosek!F393","v":0},{"$f":"Wniosek!G393","v":0},{"$f":"Wniosek!H393","v":0},{"$f":"Wniosek!I393","v":0}]
[{"$f":"Wniosek!A273","v":106},{"$f":"Wniosek!B394","v":""},{"$f":"Wniosek!C394","v":0},{"$f":"Wniosek!D394","v":0},{"$f":"Wniosek!E394","v":0},{"$f":"Wniosek!F394","v":0},{"$f":"Wniosek!G394","v":0},{"$f":"Wniosek!H394","v":0},{"$f":"Wniosek!I394","v":0}]
[{"$f":"Wniosek!A274","v":107},{"$f":"Wniosek!B395","v":""},{"$f":"Wniosek!C395","v":0},{"$f":"Wniosek!D395","v":0},{"$f":"Wniosek!E395","v":0},{"$f":"Wniosek!F395","v":0},{"$f":"Wniosek!G395","v":0},{"$f":"Wniosek!H395","v":0},{"$f":"Wniosek!I395","v":0}]
[{"$f":"Wniosek!A275","v":108},{"$f":"Wniosek!B396","v":""},{"$f":"Wniosek!C396","v":0},{"$f":"Wniosek!D396","v":0},{"$f":"Wniosek!E396","v":0},{"$f":"Wniosek!F396","v":0},{"$f":"Wniosek!G396","v":0},{"$f":"Wniosek!H396","v":0},{"$f":"Wniosek!I396","v":0}]
[{"$f":"Wniosek!A276","v":109},{"$f":"Wniosek!B397","v":""},{"$f":"Wniosek!C397","v":0},{"$f":"Wniosek!D397","v":0},{"$f":"Wniosek!E397","v":0},{"$f":"Wniosek!F397","v":0},{"$f":"Wniosek!G397","v":0},{"$f":"Wniosek!H397","v":0},{"$f":"Wniosek!I397","v":0}]
[{"$f":"Wniosek!A277","v":110},{"$f":"Wniosek!B398","v":""},{"$f":"Wniosek!C398","v":0},{"$f":"Wniosek!D398","v":0},{"$f":"Wniosek!E398","v":0},{"$f":"Wniosek!F398","v":0},{"$f":"Wniosek!G398","v":0},{"$f":"Wniosek!H398","v":0},{"$f":"Wniosek!I398","v":0}]
[{"$f":"Wniosek!A278","v":111},{"$f":"Wniosek!B399","v":""},{"$f":"Wniosek!C399","v":0},{"$f":"Wniosek!D399","v":0},{"$f":"Wniosek!E399","v":0},{"$f":"Wniosek!F399","v":0},{"$f":"Wniosek!G399","v":0},{"$f":"Wniosek!H399","v":0},{"$f":"Wniosek!I399","v":0}]
[{"$f":"Wniosek!A279","v":112},{"$f":"Wniosek!B400","v":""},{"$f":"Wniosek!C400","v":0},{"$f":"Wniosek!D400","v":0},{"$f":"Wniosek!E400","v":0},{"$f":"Wniosek!F400","v":0},{"$f":"Wniosek!G400","v":0},{"$f":"Wniosek!H400","v":0},{"$f":"Wniosek!I400","v":0}]
[{"$f":"Wniosek!A280","v":113},{"$f":"Wniosek!B401","v":""},{"$f":"Wniosek!C401","v":0},{"$f":"Wniosek!D401","v":0},{"$f":"Wniosek!E401","v":0},{"$f":"Wniosek!F401","v":0},{"$f":"Wniosek!G401","v":0},{"$f":"Wniosek!H401","v":0},{"$f":"Wniosek!I401","v":0}]
[{"$f":"Wniosek!A281","v":114},{"$f":"Wniosek!B402","v":""},{"$f":"Wniosek!C402","v":0},{"$f":"Wniosek!D402","v":0},{"$f":"Wniosek!E402","v":0},{"$f":"Wniosek!F402","v":0},{"$f":"Wniosek!G402","v":0},{"$f":"Wniosek!H402","v":0},{"$f":"Wniosek!I402","v":0}]
[{"$f":"Wniosek!A282","v":115},{"$f":"Wniosek!B403","v":""},{"$f":"Wniosek!C403","v":0},{"$f":"Wniosek!D403","v":0},{"$f":"Wniosek!E403","v":0},{"$f":"Wniosek!F403","v":0},{"$f":"Wniosek!G403","v":0},{"$f":"Wniosek!H403","v":0},{"$f":"Wniosek!I403","v":0}]

{"sheet":"Dane - linie (3)","index":9,"n_rows":116,"n_cols":9,"rows_kept":116,"cut":false,"hidden":true,"merged":[]}
[{"$f":"Wniosek!A166","v":"Lp."},{"$f":"Wniosek!B166","v":"Nazwa linii komunikacyjnej"},{"$f":"Wniosek!C166","v":"Przewidywana wielkość pracy eksploatacyjnej w okresie rozliczeniowym [wzkm]"},{"$f":"Wniosek!D166","v":"Cena usługi [zł]"},{"$f":"Wniosek!E166","v":"Planowany deficyt w okresie rozliczeniowym [zł]"},{"$f":"Wniosek!F166","v":"Część ceny usługi sfinansowana ze środków własnych organizatora \n[zł/wzkm]"},{"$f":"Wniosek!G166","v":"Procentowa wartość części ceny usługi sfinansowanej ze środków własnych organizatora [%]"},{"$f":"Wniosek!H166","v":"Kwota środków własnych organizatora [zł]"},{"$f":"Wniosek!I166","v":"Kwota dopłaty \nw okresie rozliczeniowym \n[zł]"}]
[{"$f":"Wniosek!A168","v":1},{"$f":"Wniosek!B410","v":""},{"$f":"Wniosek!C410","v":0},{"$f":"Wniosek!D410","v":0},{"$f":"Wniosek!E410","v":0},{"$f":"Wniosek!F410","v":0},{"$f":"Wniosek!G410","v":0},{"$f":"Wniosek!H410","v":0},{"$f":"Wniosek!I410","v":0}]
[{"$f":"Wniosek!A169","v":2},{"$f":"Wniosek!B411","v":""},{"$f":"Wniosek!C411","v":0},{"$f":"Wniosek!D411","v":0},{"$f":"Wniosek!E411","v":0},{"$f":"Wniosek!F411","v":0},{"$f":"Wniosek!G411","v":0},{"$f":"Wniosek!H411","v":0},{"$f":"Wniosek!I411","v":0}]
[{"$f":"Wniosek!A170","v":3},{"$f":"Wniosek!B412","v":""},{"$f":"Wniosek!C412","v":0},{"$f":"Wniosek!D412","v":0},{"$f":"Wniosek!E412","v":0},{"$f":"Wniosek!F412","v":0},{"$f":"Wniosek!G412","v":0},{"$f":"Wniosek!H412","v":0},{"$f":"Wniosek!I412","v":0}]
[{"$f":"Wniosek!A171","v":4},{"$f":"Wniosek!B413","v":""},{"$f":"Wniosek!C413","v":0},{"$f":"Wniosek!D413","v":0},{"$f":"Wniosek!E413","v":0},{"$f":"Wniosek!F413","v":0},{"$f":"Wniosek!G413","v":0},{"$f":"Wniosek!H413","v":0},{"$f":"Wniosek!I413","v":0}]
[{"$f":"Wniosek!A172","v":5},{"$f":"Wniosek!B414","v":""},{"$f":"Wniosek!C414","v":0},{"$f":"Wniosek!D414","v":0},{"$f":"Wniosek!E414","v":0},{"$f":"Wniosek!F414","v":0},{"$f":"Wniosek!G414","v":0},{"$f":"Wniosek!H414","v":0},{"$f":"Wniosek!I414","v":0}]
[{"$f":"Wniosek!A173","v":6},{"$f":"Wniosek!B415","v":""},{"$f":"Wniosek!C415","v":0},{"$f":"Wniosek!D415","v":0},{"$f":"Wniosek!E415","v":0},{"$f":"Wniosek!F415","v":0},{"$f":"Wniosek!G415","v":0},{"$f":"Wniosek!H415","v":0},{"$f":"Wniosek!I415","v":0}]
[{"$f":"Wniosek!A174","v":7},{"$f":"Wniosek!B416","v":""},{"$f":"Wniosek!C416","v":0},{"$f":"Wniosek!D416","v":0},{"$f":"Wniosek!E416","v":0},{"$f":"Wniosek!F416","v":0},{"$f":"Wniosek!G416","v":0},{"$f":"Wniosek!H416","v":0},{"$f":"Wniosek!I416","v":0}]
[{"$f":"Wniosek!A175","v":8},{"$f":"Wniosek!B417","v":""},{"$f":"Wniosek!C417","v":0},{"$f":"Wniosek!D417","v":0},{"$f":"Wniosek!E417","v":0},{"$f":"Wniosek!F417","v":0},{"$f":"Wniosek!G417","v":0},{"$f":"Wniosek!H417","v":0},{"$f":"Wniosek!I417","v":0}]
[{"$f":"Wniosek!A176","v":9},{"$f":"Wniosek!B418","v":""},{"$f":"Wniosek!C418","v":0},{"$f":"Wniosek!D418","v":0},{"$f":"Wniosek!E418","v":0},{"$f":"Wniosek!F418","v":0},{"$f":"Wniosek!G418","v":0},{"$f":"Wniosek!H418","v":0},{"$f":"Wniosek!I418","v":0}]
[{"$f":"Wniosek!A177","v":10},{"$f":"Wniosek!B419","v":""},{"$f":"Wniosek!C419","v":0},{"$f":"Wniosek!D419","v":0},{"$f":"Wniosek!E419","v":0},{"$f":"Wniosek!F419","v":0},{"$f":"Wniosek!G419","v":0},{"$f":"Wniosek!H419","v":0},{"$f":"Wniosek!I419","v":0}]
[{"$f":"Wniosek!A178","v":11},{"$f":"Wniosek!B420","v":""},{"$f":"Wniosek!C420","v":0},{"$f":"Wniosek!D420","v":0},{"$f":"Wniosek!E420","v":0},{"$f":"Wniosek!F420","v":0},{"$f":"Wniosek!G420","v":0},{"$f":"Wniosek!H420","v":0},{"$f":"Wniosek!I420","v":0}]
[{"$f":"Wniosek!A179","v":12},{"$f":"Wniosek!B421","v":""},{"$f":"Wniosek!C421","v":0},{"$f":"Wniosek!D421","v":0},{"$f":"Wniosek!E421","v":0},{"$f":"Wniosek!F421","v":0},{"$f":"Wniosek!G421","v":0},{"$f":"Wniosek!H421","v":0},{"$f":"Wniosek!I421","v":0}]
[{"$f":"Wniosek!A180","v":13},{"$f":"Wniosek!B422","v":""},{"$f":"Wniosek!C422","v":0},{"$f":"Wniosek!D422","v":0},{"$f":"Wniosek!E422","v":0},{"$f":"Wniosek!F422","v":0},{"$f":"Wniosek!G422","v":0},{"$f":"Wniosek!H422","v":0},{"$f":"Wniosek!I422","v":0}]
[{"$f":"Wniosek!A181","v":14},{"$f":"Wniosek!B423","v":""},{"$f":"Wniosek!C423","v":0},{"$f":"Wniosek!D423","v":0},{"$f":"Wniosek!E423","v":0},{"$f":"Wniosek!F423","v":0},{"$f":"Wniosek!G423","v":0},{"$f":"Wniosek!H423","v":0},{"$f":"Wniosek!I423","v":0}]
[{"$f":"Wniosek!A182","v":15},{"$f":"Wniosek!B424","v":""},{"$f":"Wniosek!C424","v":0},{"$f":"Wniosek!D424","v":0},{"$f":"Wniosek!E424","v":0},{"$f":"Wniosek!F424","v":0},{"$f":"Wniosek!G424","v":0},{"$f":"Wniosek!H424","v":0},{"$f":"Wniosek!I424","v":0}]
[{"$f":"Wniosek!A183","v":16},{"$f":"Wniosek!B425","v":""},{"$f":"Wniosek!C425","v":0},{"$f":"Wniosek!D425","v":0},{"$f":"Wniosek!E425","v":0},{"$f":"Wniosek!F425","v":0},{"$f":"Wniosek!G425","v":0},{"$f":"Wniosek!H425","v":0},{"$f":"Wniosek!I425","v":0}]
[{"$f":"Wniosek!A184","v":17},{"$f":"Wniosek!B426","v":""},{"$f":"Wniosek!C426","v":0},{"$f":"Wniosek!D426","v":0},{"$f":"Wniosek!E426","v":0},{"$f":"Wniosek!F426","v":0},{"$f":"Wniosek!G426","v":0},{"$f":"Wniosek!H426","v":0},{"$f":"Wniosek!I426","v":0}]
[{"$f":"Wniosek!A185","v":18},{"$f":"Wniosek!B427","v":""},{"$f":"Wniosek!C427","v":0},{"$f":"Wniosek!D427","v":0},{"$f":"Wniosek!E427","v":0},{"$f":"Wniosek!F427","v":0},{"$f":"Wniosek!G427","v":0},{"$f":"Wniosek!H427","v":0},{"$f":"Wniosek!I427","v":0}]
[{"$f":"Wniosek!A186","v":19},{"$f":"Wniosek!B428","v":""},{"$f":"Wniosek!C428","v":0},{"$f":"Wniosek!D428","v":0},{"$f":"Wniosek!E428","v":0},{"$f":"Wniosek!F428","v":0},{"$f":"Wniosek!G428","v":0},{"$f":"Wniosek!H428","v":0},{"$f":"Wniosek!I428","v":0}]
[{"$f":"Wniosek!A187","v":20},{"$f":"Wniosek!B429","v":""},{"$f":"Wniosek!C429","v":0},{"$f":"Wniosek!D429","v":0},{"$f":"Wniosek!E429","v":0},{"$f":"Wniosek!F429","v":0},{"$f":"Wniosek!G429","v":0},{"$f":"Wniosek!H429","v":0},{"$f":"Wniosek!I429","v":0}]
[{"$f":"Wniosek!A188","v":21},{"$f":"Wniosek!B430","v":""},{"$f":"Wniosek!C430","v":0},{"$f":"Wniosek!D430","v":0},{"$f":"Wniosek!E430","v":0},{"$f":"Wniosek!F430","v":0},{"$f":"Wniosek!G430","v":0},{"$f":"Wniosek!H430","v":0},{"$f":"Wniosek!I430","v":0}]
[{"$f":"Wniosek!A189","v":22},{"$f":"Wniosek!B431","v":""},{"$f":"Wniosek!C431","v":0},{"$f":"Wniosek!D431","v":0},{"$f":"Wniosek!E431","v":0},{"$f":"Wniosek!F431","v":0},{"$f":"Wniosek!G431","v":0},{"$f":"Wniosek!H431","v":0},{"$f":"Wniosek!I431","v":0}]
[{"$f":"Wniosek!A190","v":23},{"$f":"Wniosek!B432","v":""},{"$f":"Wniosek!C432","v":0},{"$f":"Wniosek!D432","v":0},{"$f":"Wniosek!E432","v":0},{"$f":"Wniosek!F432","v":0},{"$f":"Wniosek!G432","v":0},{"$f":"Wniosek!H432","v":0},{"$f":"Wniosek!I432","v":0}]
[{"$f":"Wniosek!A191","v":24},{"$f":"Wniosek!B433","v":""},{"$f":"Wniosek!C433","v":0},{"$f":"Wniosek!D433","v":0},{"$f":"Wniosek!E433","v":0},{"$f":"Wniosek!F433","v":0},{"$f":"Wniosek!G433","v":0},{"$f":"Wniosek!H433","v":0},{"$f":"Wniosek!I433","v":0}]
[{"$f":"Wniosek!A192","v":25},{"$f":"Wniosek!B434","v":""},{"$f":"Wniosek!C434","v":0},{"$f":"Wniosek!D434","v":0},{"$f":"Wniosek!E434","v":0},{"$f":"Wniosek!F434","v":0},{"$f":"Wniosek!G434","v":0},{"$f":"Wniosek!H434","v":0},{"$f":"Wniosek!I434","v":0}]
[{"$f":"Wniosek!A193","v":26},{"$f":"Wniosek!B435","v":""},{"$f":"Wniosek!C435","v":0},{"$f":"Wniosek!D435","v":0},{"$f":"Wniosek!E435","v":0},{"$f":"Wniosek!F435","v":0},{"$f":"Wniosek!G435","v":0},{"$f":"Wniosek!H435","v":0},{"$f":"Wniosek!I435","v":0}]
[{"$f":"Wniosek!A194","v":27},{"$f":"Wniosek!B436","v":""},{"$f":"Wniosek!C436","v":0},{"$f":"Wniosek!D436","v":0},{"$f":"Wniosek!E436","v":0},{"$f":"Wniosek!F436","v":0},{"$f":"Wniosek!G436","v":0},{"$f":"Wniosek!H436","v":0},{"$f":"Wniosek!I436","v":0}]
[{"$f":"Wniosek!A195","v":28},{"$f":"Wniosek!B437","v":""},{"$f":"Wniosek!C437","v":0},{"$f":"Wniosek!D437","v":0},{"$f":"Wniosek!E437","v":0},{"$f":"Wniosek!F437","v":0},{"$f":"Wniosek!G437","v":0},{"$f":"Wniosek!H437","v":0},{"$f":"Wniosek!I437","v":0}]
[{"$f":"Wniosek!A196","v":29},{"$f":"Wniosek!B438","v":""},{"$f":"Wniosek!C438","v":0},{"$f":"Wniosek!D438","v":0},{"$f":"Wniosek!E438","v":0},{"$f":"Wniosek!F438","v":0},{"$f":"Wniosek!G438","v":0},{"$f":"Wniosek!H438","v":0},{"$f":"Wniosek!I438","v":0}]
[{"$f":"Wniosek!A197","v":30},{"$f":"Wniosek!B439","v":""},{"$f":"Wniosek!C439","v":0},{"$f":"Wniosek!D439","v":0},{"$f":"Wniosek!E439","v":0},{"$f":"Wniosek!F439","v":0},{"$f":"Wniosek!G439","v":0},{"$f":"Wniosek!H439","v":0},{"$f":"Wniosek!I439","v":0}]
[{"$f":"Wniosek!A198","v":31},{"$f":"Wniosek!B440","v":""},{"$f":"Wniosek!C440","v":0},{"$f":"Wniosek!D440","v":0},{"$f":"Wniosek!E440","v":0},{"$f":"Wniosek!F440","v":0},{"$f":"Wniosek!G440","v":0},{"$f":"Wniosek!H440","v":0},{"$f":"Wniosek!I440","v":0}]
[{"$f":"Wniosek!A199","v":32},{"$f":"Wniosek!B441","v":""},{"$f":"Wniosek!C441","v":0},{"$f":"Wniosek!D441","v":0},{"$f":"Wniosek!E441","v":0},{"$f":"Wniosek!F441","v":0},{"$f":"Wniosek!G441","v":0},{"$f":"Wniosek!H441","v":0},{"$f":"Wniosek!I441","v":0}]
[{"$f":"Wniosek!A200","v":33},{"$f":"Wniosek!B442","v":""},{"$f":"Wniosek!C442","v":0},{"$f":"Wniosek!D442","v":0},{"$f":"Wniosek!E442","v":0},{"$f":"Wniosek!F442","v":0},{"$f":"Wniosek!G442","v":0},{"$f":"Wniosek!H442","v":0},{"$f":"Wniosek!I442","v":0}]
[{"$f":"Wniosek!A201","v":34},{"$f":"Wniosek!B443","v":""},{"$f":"Wniosek!C443","v":0},{"$f":"Wniosek!D443","v":0},{"$f":"Wniosek!E443","v":0},{"$f":"Wniosek!F443","v":0},{"$f":"Wniosek!G443","v":0},{"$f":"Wniosek!H443","v":0},{"$f":"Wniosek!I443","v":0}]
[{"$f":"Wniosek!A202","v":35},{"$f":"Wniosek!B444","v":""},{"$f":"Wniosek!C444","v":0},{"$f":"Wniosek!D444","v":0},{"$f":"Wniosek!E444","v":0},{"$f":"Wniosek!F444","v":0},{"$f":"Wniosek!G444","v":0},{"$f":"Wniosek!H444","v":0},{"$f":"Wniosek!I444","v":0}]
[{"$f":"Wniosek!A203","v":36},{"$f":"Wniosek!B445","v":""},{"$f":"Wniosek!C445","v":0},{"$f":"Wniosek!D445","v":0},{"$f":"Wniosek!E445","v":0},{"$f":"Wniosek!F445","v":0},{"$f":"Wniosek!G445","v":0},{"$f":"Wniosek!H445","v":0},{"$f":"Wniosek!I445","v":0}]
[{"$f":"Wniosek!A204","v":37},{"$f":"Wniosek!B446","v":""},{"$f":"Wniosek!C446","v":0},{"$f":"Wniosek!D446","v":0},{"$f":"Wniosek!E446","v":0},{"$f":"Wniosek!F446","v":0},{"$f":"Wniosek!G446","v":0},{"$f":"Wniosek!H446","v":0},{"$f":"Wniosek!I446","v":0}]
[{"$f":"Wniosek!A205","v":38},{"$f":"Wniosek!B447","v":""},{"$f":"Wniosek!C447","v":0},{"$f":"Wniosek!D447","v":0},{"$f":"Wniosek!E447","v":0},{"$f":"Wniosek!F447","v":0},{"$f":"Wniosek!G447","v":0},{"$f":"Wniosek!H447","v":0},{"$f":"Wniosek!I447","v":0}]
[{"$f":"Wniosek!A206","v":39},{"$f":"Wniosek!B448","v":""},{"$f":"Wniosek!C448","v":0},{"$f":"Wniosek!D448","v":0},{"$f":"Wniosek!E448","v":0},{"$f":"Wniosek!F448","v":0},{"$f":"Wniosek!G448","v":0},{"$f":"Wniosek!H448","v":0},{"$f":"Wniosek!I448","v":0}]
[{"$f":"Wniosek!A207","v":40},{"$f":"Wniosek!B449","v":""},{"$f":"Wniosek!C449","v":0},{"$f":"Wniosek!D449","v":0},{"$f":"Wniosek!E449","v":0},{"$f":"Wniosek!F449","v":0},{"$f":"Wniosek!G449","v":0},{"$f":"Wniosek!H449","v":0},{"$f":"Wniosek!I449","v":0}]
[{"$f":"Wniosek!A208","v":41},{"$f":"Wniosek!B450","v":""},{"$f":"Wniosek!C450","v":0},{"$f":"Wniosek!D450","v":0},{"$f":"Wniosek!E450","v":0},{"$f":"Wniosek!F450","v":0},{"$f":"Wniosek!G450","v":0},{"$f":"Wniosek!H450","v":0},{"$f":"Wniosek!I450","v":0}]
[{"$f":"Wniosek!A209","v":42},{"$f":"Wniosek!B451","v":""},{"$f":"Wniosek!C451","v":0},{"$f":"Wniosek!D451","v":0},{"$f":"Wniosek!E451","v":0},{"$f":"Wniosek!F451","v":0},{"$f":"Wniosek!G451","v":0},{"$f":"Wniosek!H451","v":0},{"$f":"Wniosek!I451","v":0}]
[{"$f":"Wniosek!A210","v":43},{"$f":"Wniosek!B452","v":""},{"$f":"Wniosek!C452","v":0},{"$f":"Wniosek!D452","v":0},{"$f":"Wniosek!E452","v":0},{"$f":"Wniosek!F452","v":0},{"$f":"Wniosek!G452","v":0},{"$f":"Wniosek!H452","v":0},{"$f":"Wniosek!I452","v":0}]
[{"$f":"Wniosek!A211","v":44},{"$f":"Wniosek!B453","v":""},{"$f":"Wniosek!C453","v":0},{"$f":"Wniosek!D453","v":0},{"$f":"Wniosek!E453","v":0},{"$f":"Wniosek!F453","v":0},{"$f":"Wniosek!G453","v":0},{"$f":"Wniosek!H453","v":0},{"$f":"Wniosek!I453","v":0}]
[{"$f":"Wniosek!A212","v":45},{"$f":"Wniosek!B454","v":""},{"$f":"Wniosek!C454","v":0},{"$f":"Wniosek!D454","v":0},{"$f":"Wniosek!E454","v":0},{"$f":"Wniosek!F454","v":0},{"$f":"Wniosek!G454","v":0},{"$f":"Wniosek!H454","v":0},{"$f":"Wniosek!I454","v":0}]
[{"$f":"Wniosek!A213","v":46},{"$f":"Wniosek!B455","v":""},{"$f":"Wniosek!C455","v":0},{"$f":"Wniosek!D455","v":0},{"$f":"Wniosek!E455","v":0},{"$f":"Wniosek!F455","v":0},{"$f":"Wniosek!G455","v":0},{"$f":"Wniosek!H455","v":0},{"$f":"Wniosek!I455","v":0}]
[{"$f":"Wniosek!A214","v":47},{"$f":"Wniosek!B456","v":""},{"$f":"Wniosek!C456","v":0},{"$f":"Wniosek!D456","v":0},{"$f":"Wniosek!E456","v":0},{"$f":"Wniosek!F456","v":0},{"$f":"Wniosek!G456","v":0},{"$f":"Wniosek!H456","v":0},{"$f":"Wniosek!I456","v":0}]
[{"$f":"Wniosek!A215","v":48},{"$f":"Wniosek!B457","v":""},{"$f":"Wniosek!C457","v":0},{"$f":"Wniosek!D457","v":0},{"$f":"Wniosek!E457","v":0},{"$f":"Wniosek!F457","v":0},{"$f":"Wniosek!G457","v":0},{"$f":"Wniosek!H457","v":0},{"$f":"Wniosek!I457","v":0}]
[{"$f":"Wniosek!A216","v":49},{"$f":"Wniosek!B458","v":""},{"$f":"Wniosek!C458","v":0},{"$f":"Wniosek!D458","v":0},{"$f":"Wniosek!E458","v":0},{"$f":"Wniosek!F458","v":0},{"$f":"Wniosek!G458","v":0},{"$f":"Wniosek!H458","v":0},{"$f":"Wniosek!I458","v":0}]
[{"$f":"Wniosek!A217","v":50},{"$f":"Wniosek!B459","v":""},{"$f":"Wniosek!C459","v":0},{"$f":"Wniosek!D459","v":0},{"$f":"Wniosek!E459","v":0},{"$f":"Wniosek!F459","v":0},{"$f":"Wniosek!G459","v":0},{"$f":"Wniosek!H459","v":0},{"$f":"Wniosek!I459","v":0}]
[{"$f":"Wniosek!A218","v":51},{"$f":"Wniosek!B460","v":""},{"$f":"Wniosek!C460","v":0},{"$f":"Wniosek!D460","v":0},{"$f":"Wniosek!E460","v":0},{"$f":"Wniosek!F460","v":0},{"$f":"Wniosek!G460","v":0},{"$f":"Wniosek!H460","v":0},{"$f":"Wniosek!I460","v":0}]
[{"$f":"Wniosek!A219","v":52},{"$f":"Wniosek!B461","v":""},{"$f":"Wniosek!C461","v":0},{"$f":"Wniosek!D461","v":0},{"$f":"Wniosek!E461","v":0},{"$f":"Wniosek!F461","v":0},{"$f":"Wniosek!G461","v":0},{"$f":"Wniosek!H461","v":0},{"$f":"Wniosek!I461","v":0}]
[{"$f":"Wniosek!A220","v":53},{"$f":"Wniosek!B462","v":""},{"$f":"Wniosek!C462","v":0},{"$f":"Wniosek!D462","v":0},{"$f":"Wniosek!E462","v":0},{"$f":"Wniosek!F462","v":0},{"$f":"Wniosek!G462","v":0},{"$f":"Wniosek!H462","v":0},{"$f":"Wniosek!I462","v":0}]
[{"$f":"Wniosek!A221","v":54},{"$f":"Wniosek!B463","v":""},{"$f":"Wniosek!C463","v":0},{"$f":"Wniosek!D463","v":0},{"$f":"Wniosek!E463","v":0},{"$f":"Wniosek!F463","v":0},{"$f":"Wniosek!G463","v":0},{"$f":"Wniosek!H463","v":0},{"$f":"Wniosek!I463","v":0}]
[{"$f":"Wniosek!A222","v":55},{"$f":"Wniosek!B464","v":""},{"$f":"Wniosek!C464","v":0},{"$f":"Wniosek!D464","v":0},{"$f":"Wniosek!E464","v":0},{"$f":"Wniosek!F464","v":0},{"$f":"Wniosek!G464","v":0},{"$f":"Wniosek!H464","v":0},{"$f":"Wniosek!I464","v":0}]
[{"$f":"Wniosek!A223","v":56},{"$f":"Wniosek!B465","v":""},{"$f":"Wniosek!C465","v":0},{"$f":"Wniosek!D465","v":0},{"$f":"Wniosek!E465","v":0},{"$f":"Wniosek!F465","v":0},{"$f":"Wniosek!G465","v":0},{"$f":"Wniosek!H465","v":0},{"$f":"Wniosek!I465","v":0}]
[{"$f":"Wniosek!A224","v":57},{"$f":"Wniosek!B466","v":""},{"$f":"Wniosek!C466","v":0},{"$f":"Wniosek!D466","v":0},{"$f":"Wniosek!E466","v":0},{"$f":"Wniosek!F466","v":0},{"$f":"Wniosek!G466","v":0},{"$f":"Wniosek!H466","v":0},{"$f":"Wniosek!I466","v":0}]
[{"$f":"Wniosek!A225","v":58},{"$f":"Wniosek!B467","v":""},{"$f":"Wniosek!C467","v":0},{"$f":"Wniosek!D467","v":0},{"$f":"Wniosek!E467","v":0},{"$f":"Wniosek!F467","v":0},{"$f":"Wniosek!G467","v":0},{"$f":"Wniosek!H467","v":0},{"$f":"Wniosek!I467","v":0}]
[{"$f":"Wniosek!A226","v":59},{"$f":"Wniosek!B468","v":""},{"$f":"Wniosek!C468","v":0},{"$f":"Wniosek!D468","v":0},{"$f":"Wniosek!E468","v":0},{"$f":"Wniosek!F468","v":0},{"$f":"Wniosek!G468","v":0},{"$f":"Wniosek!H468","v":0},{"$f":"Wniosek!I468","v":0}]
[{"$f":"Wniosek!A227","v":60},{"$f":"Wniosek!B469","v":""},{"$f":"Wniosek!C469","v":0},{"$f":"Wniosek!D469","v":0},{"$f":"Wniosek!E469","v":0},{"$f":"Wniosek!F469","v":0},{"$f":"Wniosek!G469","v":0},{"$f":"Wniosek!H469","v":0},{"$f":"Wniosek!I469","v":0}]
[{"$f":"Wniosek!A228","v":61},{"$f":"Wniosek!B470","v":""},{"$f":"Wniosek!C470","v":0},{"$f":"Wniosek!D470","v":0},{"$f":"Wniosek!E470","v":0},{"$f":"Wniosek!F470","v":0},{"$f":"Wniosek!G470","v":0},{"$f":"Wniosek!H470","v":0},{"$f":"Wniosek!I470","v":0}]
[{"$f":"Wniosek!A229","v":62},{"$f":"Wniosek!B471","v":""},{"$f":"Wniosek!C471","v":0},{"$f":"Wniosek!D471","v":0},{"$f":"Wniosek!E471","v":0},{"$f":"Wniosek!F471","v":0},{"$f":"Wniosek!G471","v":0},{"$f":"Wniosek!H471","v":0},{"$f":"Wniosek!I471","v":0}]
[{"$f":"Wniosek!A230","v":63},{"$f":"Wniosek!B472","v":""},{"$f":"Wniosek!C472","v":0},{"$f":"Wniosek!D472","v":0},{"$f":"Wniosek!E472","v":0},{"$f":"Wniosek!F472","v":0},{"$f":"Wniosek!G472","v":0},{"$f":"Wniosek!H472","v":0},{"$f":"Wniosek!I472","v":0}]
[{"$f":"Wniosek!A231","v":64},{"$f":"Wniosek!B473","v":""},{"$f":"Wniosek!C473","v":0},{"$f":"Wniosek!D473","v":0},{"$f":"Wniosek!E473","v":0},{"$f":"Wniosek!F473","v":0},{"$f":"Wniosek!G473","v":0},{"$f":"Wniosek!H473","v":0},{"$f":"Wniosek!I473","v":0}]
[{"$f":"Wniosek!A232","v":65},{"$f":"Wniosek!B474","v":""},{"$f":"Wniosek!C474","v":0},{"$f":"Wniosek!D474","v":0},{"$f":"Wniosek!E474","v":0},{"$f":"Wniosek!F474","v":0},{"$f":"Wniosek!G474","v":0},{"$f":"Wniosek!H474","v":0},{"$f":"Wniosek!I474","v":0}]
[{"$f":"Wniosek!A233","v":66},{"$f":"Wniosek!B475","v":""},{"$f":"Wniosek!C475","v":0},{"$f":"Wniosek!D475","v":0},{"$f":"Wniosek!E475","v":0},{"$f":"Wniosek!F475","v":0},{"$f":"Wniosek!G475","v":0},{"$f":"Wniosek!H475","v":0},{"$f":"Wniosek!I475","v":0}]
[{"$f":"Wniosek!A234","v":67},{"$f":"Wniosek!B476","v":""},{"$f":"Wniosek!C476","v":0},{"$f":"Wniosek!D476","v":0},{"$f":"Wniosek!E476","v":0},{"$f":"Wniosek!F476","v":0},{"$f":"Wniosek!G476","v":0},{"$f":"Wniosek!H476","v":0},{"$f":"Wniosek!I476","v":0}]
[{"$f":"Wniosek!A235","v":68},{"$f":"Wniosek!B477","v":""},{"$f":"Wniosek!C477","v":0},{"$f":"Wniosek!D477","v":0},{"$f":"Wniosek!E477","v":0},{"$f":"Wniosek!F477","v":0},{"$f":"Wniosek!G477","v":0},{"$f":"Wniosek!H477","v":0},{"$f":"Wniosek!I477","v":0}]
[{"$f":"Wniosek!A236","v":69},{"$f":"Wniosek!B478","v":""},{"$f":"Wniosek!C478","v":0},{"$f":"Wniosek!D478","v":0},{"$f":"Wniosek!E478","v":0},{"$f":"Wniosek!F478","v":0},{"$f":"Wniosek!G478","v":0},{"$f":"Wniosek!H478","v":0},{"$f":"Wniosek!I478","v":0}]
[{"$f":"Wniosek!A237","v":70},{"$f":"Wniosek!B479","v":""},{"$f":"Wniosek!C479","v":0},{"$f":"Wniosek!D479","v":0},{"$f":"Wniosek!E479","v":0},{"$f":"Wniosek!F479","v":0},{"$f":"Wniosek!G479","v":0},{"$f":"Wniosek!H479","v":0},{"$f":"Wniosek!I479","v":0}]
[{"$f":"Wniosek!A238","v":71},{"$f":"Wniosek!B480","v":""},{"$f":"Wniosek!C480","v":0},{"$f":"Wniosek!D480","v":0},{"$f":"Wniosek!E480","v":0},{"$f":"Wniosek!F480","v":0},{"$f":"Wniosek!G480","v":0},{"$f":"Wniosek!H480","v":0},{"$f":"Wniosek!I480","v":0}]
[{"$f":"Wniosek!A239","v":72},{"$f":"Wniosek!B481","v":""},{"$f":"Wniosek!C481","v":0},{"$f":"Wniosek!D481","v":0},{"$f":"Wniosek!E481","v":0},{"$f":"Wniosek!F481","v":0},{"$f":"Wniosek!G481","v":0},{"$f":"Wniosek!H481","v":0},{"$f":"Wniosek!I481","v":0}]
[{"$f":"Wniosek!A240","v":73},{"$f":"Wniosek!B482","v":""},{"$f":"Wniosek!C482","v":0},{"$f":"Wniosek!D482","v":0},{"$f":"Wniosek!E482","v":0},{"$f":"Wniosek!F482","v":0},{"$f":"Wniosek!G482","v":0},{"$f":"Wniosek!H482","v":0},{"$f":"Wniosek!I482","v":0}]
[{"$f":"Wniosek!A241","v":74},{"$f":"Wniosek!B483","v":""},{"$f":"Wniosek!C483","v":0},{"$f":"Wniosek!D483","v":0},{"$f":"Wniosek!E483","v":0},{"$f":"Wniosek!F483","v":0},{"$f":"Wniosek!G483","v":0},{"$f":"Wniosek!H483","v":0},{"$f":"Wniosek!I483","v":0}]
[{"$f":"Wniosek!A242","v":75},{"$f":"Wniosek!B484","v":""},{"$f":"Wniosek!C484","v":0},{"$f":"Wniosek!D484","v":0},{"$f":"Wniosek!E484","v":0},{"$f":"Wniosek!F484","v":0},{"$f":"Wniosek!G484","v":0},{"$f":"Wniosek!H484","v":0},{"$f":"Wniosek!I484","v":0}]
[{"$f":"Wniosek!A243","v":76},{"$f":"Wniosek!B485","v":""},{"$f":"Wniosek!C485","v":0},{"$f":"Wniosek!D485","v":0},{"$f":"Wniosek!E485","v":0},{"$f":"Wniosek!F485","v":0},{"$f":"Wniosek!G485","v":0},{"$f":"Wniosek!H485","v":0},{"$f":"Wniosek!I485","v":0}]
[{"$f":"Wniosek!A244","v":77},{"$f":"Wniosek!B486","v":""},{"$f":"Wniosek!C486","v":0},{"$f":"Wniosek!D486","v":0},{"$f":"Wniosek!E486","v":0},{"$f":"Wniosek!F486","v":0},{"$f":"Wniosek!G486","v":0},{"$f":"Wniosek!H486","v":0},{"$f":"Wniosek!I486","v":0}]
[{"$f":"Wniosek!A245","v":78},{"$f":"Wniosek!B487","v":""},{"$f":"Wniosek!C487","v":0},{"$f":"Wniosek!D487","v":0},{"$f":"Wniosek!E487","v":0},{"$f":"Wniosek!F487","v":0},{"$f":"Wniosek!G487","v":0},{"$f":"Wniosek!H487","v":0},{"$f":"Wniosek!I487","v":0}]
[{"$f":"Wniosek!A246","v":79},{"$f":"Wniosek!B488","v":""},{"$f":"Wniosek!C488","v":0},{"$f":"Wniosek!D488","v":0},{"$f":"Wniosek!E488","v":0},{"$f":"Wniosek!F488","v":0},{"$f":"Wniosek!G488","v":0},{"$f":"Wniosek!H488","v":0},{"$f":"Wniosek!I488","v":0}]
[{"$f":"Wniosek!A247","v":80},{"$f":"Wniosek!B489","v":""},{"$f":"Wniosek!C489","v":0},{"$f":"Wniosek!D489","v":0},{"$f":"Wniosek!E489","v":0},{"$f":"Wniosek!F489","v":0},{"$f":"Wniosek!G489","v":0},{"$f":"Wniosek!H489","v":0},{"$f":"Wniosek!I489","v":0}]
[{"$f":"Wniosek!A248","v":81},{"$f":"Wniosek!B490","v":""},{"$f":"Wniosek!C490","v":0},{"$f":"Wniosek!D490","v":0},{"$f":"Wniosek!E490","v":0},{"$f":"Wniosek!F490","v":0},{"$f":"Wniosek!G490","v":0},{"$f":"Wniosek!H490","v":0},{"$f":"Wniosek!I490","v":0}]
[{"$f":"Wniosek!A249","v":82},{"$f":"Wniosek!B491","v":""},{"$f":"Wniosek!C491","v":0},{"$f":"Wniosek!D491","v":0},{"$f":"Wniosek!E491","v":0},{"$f":"Wniosek!F491","v":0},{"$f":"Wniosek!G491","v":0},{"$f":"Wniosek!H491","v":0},{"$f":"Wniosek!I491","v":0}]
[{"$f":"Wniosek!A250","v":83},{"$f":"Wniosek!B492","v":""},{"$f":"Wniosek!C492","v":0},{"$f":"Wniosek!D492","v":0},{"$f":"Wniosek!E492","v":0},{"$f":"Wniosek!F492","v":0},{"$f":"Wniosek!G492","v":0},{"$f":"Wniosek!H492","v":0},{"$f":"Wniosek!I492","v":0}]
[{"$f":"Wniosek!A251","v":84},{"$f":"Wniosek!B493","v":""},{"$f":"Wniosek!C493","v":0},{"$f":"Wniosek!D493","v":0},{"$f":"Wniosek!E493","v":0},{"$f":"Wniosek!F493","v":0},{"$f":"Wniosek!G493","v":0},{"$f":"Wniosek!H493","v":0},{"$f":"Wniosek!I493","v":0}]
[{"$f":"Wniosek!A252","v":85},{"$f":"Wniosek!B494","v":""},{"$f":"Wniosek!C494","v":0},{"$f":"Wniosek!D494","v":0},{"$f":"Wniosek!E494","v":0},{"$f":"Wniosek!F494","v":0},{"$f":"Wniosek!G494","v":0},{"$f":"Wniosek!H494","v":0},{"$f":"Wniosek!I494","v":0}]
[{"$f":"Wniosek!A253","v":86},{"$f":"Wniosek!B495","v":""},{"$f":"Wniosek!C495","v":0},{"$f":"Wniosek!D495","v":0},{"$f":"Wniosek!E495","v":0},{"$f":"Wniosek!F495","v":0},{"$f":"Wniosek!G495","v":0},{"$f":"Wniosek!H495","v":0},{"$f":"Wniosek!I495","v":0}]
[{"$f":"Wniosek!A254","v":87},{"$f":"Wniosek!B496","v":""},{"$f":"Wniosek!C496","v":0},{"$f":"Wniosek!D496","v":0},{"$f":"Wniosek!E496","v":0},{"$f":"Wniosek!F496","v":0},{"$f":"Wniosek!G496","v":0},{"$f":"Wniosek!H496","v":0},{"$f":"Wniosek!I496","v":0}]
[{"$f":"Wniosek!A255","v":88},{"$f":"Wniosek!B497","v":""},{"$f":"Wniosek!C497","v":0},{"$f":"Wniosek!D497","v":0},{"$f":"Wniosek!E497","v":0},{"$f":"Wniosek!F497","v":0},{"$f":"Wniosek!G497","v":0},{"$f":"Wniosek!H497","v":0},{"$f":"Wniosek!I497","v":0}]
[{"$f":"Wniosek!A256","v":89},{"$f":"Wniosek!B498","v":""},{"$f":"Wniosek!C498","v":0},{"$f":"Wniosek!D498","v":0},{"$f":"Wniosek!E498","v":0},{"$f":"Wniosek!F498","v":0},{"$f":"Wniosek!G498","v":0},{"$f":"Wniosek!H498","v":0},{"$f":"Wniosek!I498","v":0}]
[{"$f":"Wniosek!A257","v":90},{"$f":"Wniosek!B499","v":""},{"$f":"Wniosek!C499","v":0},{"$f":"Wniosek!D499","v":0},{"$f":"Wniosek!E499","v":0},{"$f":"Wniosek!F499","v":0},{"$f":"Wniosek!G499","v":0},{"$f":"Wniosek!H499","v":0},{"$f":"Wniosek!I499","v":0}]
[{"$f":"Wniosek!A258","v":91},{"$f":"Wniosek!B500","v":""},{"$f":"Wniosek!C500","v":0},{"$f":"Wniosek!D500","v":0},{"$f":"Wniosek!E500","v":0},{"$f":"Wniosek!F500","v":0},{"$f":"Wniosek!G500","v":0},{"$f":"Wniosek!H500","v":0},{"$f":"Wniosek!I500","v":0}]
[{"$f":"Wniosek!A259","v":92},{"$f":"Wniosek!B501","v":""},{"$f":"Wniosek!C501","v":0},{"$f":"Wniosek!D501","v":0},{"$f":"Wniosek!E501","v":0},{"$f":"Wniosek!F501","v":0},{"$f":"Wniosek!G501","v":0},{"$f":"Wniosek!H501","v":0},{"$f":"Wniosek!I501","v":0}]
[{"$f":"Wniosek!A260","v":93},{"$f":"Wniosek!B502","v":""},{"$f":"Wniosek!C502","v":0},{"$f":"Wniosek!D502","v":0},{"$f":"Wniosek!E502","v":0},{"$f":"Wniosek!F502","v":0},{"$f":"Wniosek!G502","v":0},{"$f":"Wniosek!H502","v":0},{"$f":"Wniosek!I502","v":0}]
[{"$f":"Wniosek!A261","v":94},{"$f":"Wniosek!B503","v":""},{"$f":"Wniosek!C503","v":0},{"$f":"Wniosek!D503","v":0},{"$f":"Wniosek!E503","v":0},{"$f":"Wniosek!F503","v":0},{"$f":"Wniosek!G503","v":0},{"$f":"Wniosek!H503","v":0},{"$f":"Wniosek!I503","v":0}]
[{"$f":"Wniosek!A262","v":95},{"$f":"Wniosek!B504","v":""},{"$f":"Wniosek!C504","v":0},{"$f":"Wniosek!D504","v":0},{"$f":"Wniosek!E504","v":0},{"$f":"Wniosek!F504","v":0},{"$f":"Wniosek!G504","v":0},{"$f":"Wniosek!H504","v":0},{"$f":"Wniosek!I504","v":0}]
[{"$f":"Wniosek!A263","v":96},{"$f":"Wniosek!B505","v":""},{"$f":"Wniosek!C505","v":0},{"$f":"Wniosek!D505","v":0},{"$f":"Wniosek!E505","v":0},{"$f":"Wniosek!F505","v":0},{"$f":"Wniosek!G505","v":0},{"$f":"Wniosek!H505","v":0},{"$f":"Wniosek!I505","v":0}]
[{"$f":"Wniosek!A264","v":97},{"$f":"Wniosek!B506","v":""},{"$f":"Wniosek!C506","v":0},{"$f":"Wniosek!D506","v":0},{"$f":"Wniosek!E506","v":0},{"$f":"Wniosek!F506","v":0},{"$f":"Wniosek!G506","v":0},{"$f":"Wniosek!H506","v":0},{"$f":"Wniosek!I506","v":0}]
[{"$f":"Wniosek!A265","v":98},{"$f":"Wniosek!B507","v":""},{"$f":"Wniosek!C507","v":0},{"$f":"Wniosek!D507","v":0},{"$f":"Wniosek!E507","v":0},{"$f":"Wniosek!F507","v":0},{"$f":"Wniosek!G507","v":0},{"$f":"Wniosek!H507","v":0},{"$f":"Wniosek!I507","v":0}]
[{"$f":"Wniosek!A266","v":99},{"$f":"Wniosek!B508","v":""},{"$f":"Wniosek!C508","v":0},{"$f":"Wniosek!D508","v":0},{"$f":"Wniosek!E508","v":0},{"$f":"Wniosek!F508","v":0},{"$f":"Wniosek!G508","v":0},{"$f":"Wniosek!H508","v":0},{"$f":"Wniosek!I508","v":0}]
[{"$f":"Wniosek!A267","v":100},{"$f":"Wniosek!B509","v":""},{"$f":"Wniosek!C509","v":0},{"$f":"Wniosek!D509","v":0},{"$f":"Wniosek!E509","v":0},{"$f":"Wniosek!F509","v":0},{"$f":"Wniosek!G509","v":0},{"$f":"Wniosek!H509","v":0},{"$f":"Wniosek!I509","v":0}]
[{"$f":"Wniosek!A268","v":101},{"$f":"Wniosek!B510","v":""},{"$f":"Wniosek!C510","v":0},{"$f":"Wniosek!D510","v":0},{"$f":"Wniosek!E510","v":0},{"$f":"Wniosek!F510","v":0},{"$f":"Wniosek!G510","v":0},{"$f":"Wniosek!H510","v":0},{"$f":"Wniosek!I510","v":0}]
[{"$f":"Wniosek!A269","v":102},{"$f":"Wniosek!B511","v":""},{"$f":"Wniosek!C511","v":0},{"$f":"Wniosek!D511","v":0},{"$f":"Wniosek!E511","v":0},{"$f":"Wniosek!F511","v":0},{"$f":"Wniosek!G511","v":0},{"$f":"Wniosek!H511","v":0},{"$f":"Wniosek!I511","v":0}]
[{"$f":"Wniosek!A270","v":103},{"$f":"Wniosek!B512","v":""},{"$f":"Wniosek!C512","v":0},{"$f":"Wniosek!D512","v":0},{"$f":"Wniosek!E512","v":0},{"$f":"Wniosek!F512","v":0},{"$f":"Wniosek!G512","v":0},{"$f":"Wniosek!H512","v":0},{"$f":"Wniosek!I512","v":0}]
[{"$f":"Wniosek!A271","v":104},{"$f":"Wniosek!B513","v":""},{"$f":"Wniosek!C513","v":0},{"$f":"Wniosek!D513","v":0},{"$f":"Wniosek!E513","v":0},{"$f":"Wniosek!F513","v":0},{"$f":"Wniosek!G513","v":0},{"$f":"Wniosek!H513","v":0},{"$f":"Wniosek!I513","v":0}]
[{"$f":"Wniosek!A272","v":105},{"$f":"Wniosek!B514","v":""},{"$f":"Wniosek!C514","v":0},{"$f":"Wniosek!D514","v":0},{"$f":"Wniosek!E514","v":0},{"$f":"Wniosek!F514","v":0},{"$f":"Wniosek!G514","v":0},{"$f":"Wniosek!H514","v":0},{"$f":"Wniosek!I514","v":0}]
[{"$f":"Wniosek!A273","v":106},{"$f":"Wniosek!B515","v":""},{"$f":"Wniosek!C515","v":0},{"$f":"Wniosek!D515","v":0},{"$f":"Wniosek!E515","v":0},{"$f":"Wniosek!F515","v":0},{"$f":"Wniosek!G515","v":0},{"$f":"Wniosek!H515","v":0},{"$f":"Wniosek!I515","v":0}]
[{"$f":"Wniosek!A274","v":107},{"$f":"Wniosek!B516","v":""},{"$f":"Wniosek!C516","v":0},{"$f":"Wniosek!D516","v":0},{"$f":"Wniosek!E516","v":0},{"$f":"Wniosek!F516","v":0},{"$f":"Wniosek!G516","v":0},{"$f":"Wniosek!H516","v":0},{"$f":"Wniosek!I516","v":0}]
[{"$f":"Wniosek!A275","v":108},{"$f":"Wniosek!B517","v":""},{"$f":"Wniosek!C517","v":0},{"$f":"Wniosek!D517","v":0},{"$f":"Wniosek!E517","v":0},{"$f":"Wniosek!F517","v":0},{"$f":"Wniosek!G517","v":0},{"$f":"Wniosek!H517","v":0},{"$f":"Wniosek!I517","v":0}]
[{"$f":"Wniosek!A276","v":109},{"$f":"Wniosek!B518","v":""},{"$f":"Wniosek!C518","v":0},{"$f":"Wniosek!D518","v":0},{"$f":"Wniosek!E518","v":0},{"$f":"Wniosek!F518","v":0},{"$f":"Wniosek!G518","v":0},{"$f":"Wniosek!H518","v":0},{"$f":"Wniosek!I518","v":0}]
[{"$f":"Wniosek!A277","v":110},{"$f":"Wniosek!B519","v":""},{"$f":"Wniosek!C519","v":0},{"$f":"Wniosek!D519","v":0},{"$f":"Wniosek!E519","v":0},{"$f":"Wniosek!F519","v":0},{"$f":"Wniosek!G519","v":0},{"$f":"Wniosek!H519","v":0},{"$f":"Wniosek!I519","v":0}]
[{"$f":"Wniosek!A278","v":111},{"$f":"Wniosek!B520","v":""},{"$f":"Wniosek!C520","v":0},{"$f":"Wniosek!D520","v":0},{"$f":"Wniosek!E520","v":0},{"$f":"Wniosek!F520","v":0},{"$f":"Wniosek!G520","v":0},{"$f":"Wniosek!H520","v":0},{"$f":"Wniosek!I520","v":0}]
[{"$f":"Wniosek!A279","v":112},{"$f":"Wniosek!B521","v":""},{"$f":"Wniosek!C521","v":0},{"$f":"Wniosek!D521","v":0},{"$f":"Wniosek!E521","v":0},{"$f":"Wniosek!F521","v":0},{"$f":"Wniosek!G521","v":0},{"$f":"Wniosek!H521","v":0},{"$f":"Wniosek!I521","v":0}]
[{"$f":"Wniosek!A280","v":113},{"$f":"Wniosek!B522","v":""},{"$f":"Wniosek!C522","v":0},{"$f":"Wniosek!D522","v":0},{"$f":"Wniosek!E522","v":0},{"$f":"Wniosek!F522","v":0},{"$f":"Wniosek!G522","v":0},{"$f":"Wniosek!H522","v":0},{"$f":"Wniosek!I522","v":0}]
[{"$f":"Wniosek!A281","v":114},{"$f":"Wniosek!B523","v":""},{"$f":"Wniosek!C523","v":0},{"$f":"Wniosek!D523","v":0},{"$f":"Wniosek!E523","v":0},{"$f":"Wniosek!F523","v":0},{"$f":"Wniosek!G523","v":0},{"$f":"Wniosek!H523","v":0},{"$f":"Wniosek!I523","v":0}]
[{"$f":"Wniosek!A282","v":115},{"$f":"Wniosek!B524","v":""},{"$f":"Wniosek!C524","v":0},{"$f":"Wniosek!D524","v":0},{"$f":"Wniosek!E524","v":0},{"$f":"Wniosek!F524","v":0},{"$f":"Wniosek!G524","v":0},{"$f":"Wniosek!H524","v":0},{"$f":"Wniosek!I524","v":0}]

{"sheet":"Linie - kwartał","index":10,"n_rows":116,"n_cols":7,"rows_kept":116,"cut":false,"hidden":true,"merged":[]}
[{"$f":"Wniosek!A166","v":"Lp."},{"$f":"Wniosek!B166","v":"Nazwa linii komunikacyjnej"},{"$f":"Wniosek!C166","v":"Przewidywana wielkość pracy eksploatacyjnej w okresie rozliczeniowym [wzkm]"},{"$f":"Wniosek!E166","v":"Planowany deficyt w okresie rozliczeniowym [zł]"},{"$f":"Wniosek!G166","v":"Procentowa wartość części ceny usługi sfinansowanej ze środków własnych organizatora [%]"},{"$f":"Wniosek!H166","v":"Kwota środków własnych organizatora [zł]"},{"$f":"Wniosek!I166","v":"Kwota dopłaty \nw okresie rozliczeniowym \n[zł]"}]
[{"$f":"Wniosek!A35","v":1},{"$f":"Wniosek!B35","v":0},{"$f":"Wniosek!C168+Wniosek!C289+Wniosek!C410","v":0},{"$f":"Wniosek!E168+Wniosek!E289+Wniosek!E410","v":0},{"$f":"IFERROR(F2/D2,0)","v":0},{"$f":"Wniosek!H168+Wniosek!H289+Wniosek!H410","v":0},{"$f":"Wniosek!I168+Wniosek!I289+Wniosek!I410","v":0}]
[{"$f":"Wniosek!A36","v":2},{"$f":"Wniosek!B36","v":0},{"$f":"Wniosek!C169+Wniosek!C290+Wniosek!C411","v":0},{"$f":"Wniosek!E169+Wniosek!E290+Wniosek!E411","v":0},{"$f":"IFERROR(F3/D3,0)","v":0},{"$f":"Wniosek!H169+Wniosek!H290+Wniosek!H411","v":0},{"$f":"Wniosek!I169+Wniosek!I290+Wniosek!I411","v":0}]
[{"$f":"Wniosek!A37","v":3},{"$f":"Wniosek!B37","v":0},{"$f":"Wniosek!C170+Wniosek!C291+Wniosek!C412","v":0},{"$f":"Wniosek!E170+Wniosek!E291+Wniosek!E412","v":0},0,{"$f":"Wniosek!H170+Wniosek!H291+Wniosek!H412","v":0},{"$f":"Wniosek!I170+Wniosek!I291+Wniosek!I412","v":0}]
[{"$f":"Wniosek!A38","v":4},{"$f":"Wniosek!B38","v":0},{"$f":"Wniosek!C171+Wniosek!C292+Wniosek!C413","v":0},{"$f":"Wniosek!E171+Wniosek!E292+Wniosek!E413","v":0},0,{"$f":"Wniosek!H171+Wniosek!H292+Wniosek!H413","v":0},{"$f":"Wniosek!I171+Wniosek!I292+Wniosek!I413","v":0}]
[{"$f":"Wniosek!A39","v":5},{"$f":"Wniosek!B39","v":0},{"$f":"Wniosek!C172+Wniosek!C293+Wniosek!C414","v":0},{"$f":"Wniosek!E172+Wniosek!E293+Wniosek!E414","v":0},0,{"$f":"Wniosek!H172+Wniosek!H293+Wniosek!H414","v":0},{"$f":"Wniosek!I172+Wniosek!I293+Wniosek!I414","v":0}]
[{"$f":"Wniosek!A40","v":6},{"$f":"Wniosek!B40","v":0},{"$f":"Wniosek!C173+Wniosek!C294+Wniosek!C415","v":0},{"$f":"Wniosek!E173+Wniosek!E294+Wniosek!E415","v":0},0,{"$f":"Wniosek!H173+Wniosek!H294+Wniosek!H415","v":0},{"$f":"Wniosek!I173+Wniosek!I294+Wniosek!I415","v":0}]
[{"$f":"Wniosek!A41","v":7},{"$f":"Wniosek!B41","v":0},{"$f":"Wniosek!C174+Wniosek!C295+Wniosek!C416","v":0},{"$f":"Wniosek!E174+Wniosek!E295+Wniosek!E416","v":0},0,{"$f":"Wniosek!H174+Wniosek!H295+Wniosek!H416","v":0},{"$f":"Wniosek!I174+Wniosek!I295+Wniosek!I416","v":0}]
[{"$f":"Wniosek!A42","v":8},{"$f":"Wniosek!B42","v":0},{"$f":"Wniosek!C175+Wniosek!C296+Wniosek!C417","v":0},{"$f":"Wniosek!E175+Wniosek!E296+Wniosek!E417","v":0},0,{"$f":"Wniosek!H175+Wniosek!H296+Wniosek!H417","v":0},{"$f":"Wniosek!I175+Wniosek!I296+Wniosek!I417","v":0}]
[{"$f":"Wniosek!A43","v":9},{"$f":"Wniosek!B43","v":0},{"$f":"Wniosek!C176+Wniosek!C297+Wniosek!C418","v":0},{"$f":"Wniosek!E176+Wniosek!E297+Wniosek!E418","v":0},0,{"$f":"Wniosek!H176+Wniosek!H297+Wniosek!H418","v":0},{"$f":"Wniosek!I176+Wniosek!I297+Wniosek!I418","v":0}]
[{"$f":"Wniosek!A44","v":10},{"$f":"Wniosek!B44","v":0},{"$f":"Wniosek!C177+Wniosek!C298+Wniosek!C419","v":0},{"$f":"Wniosek!E177+Wniosek!E298+Wniosek!E419","v":0},0,{"$f":"Wniosek!H177+Wniosek!H298+Wniosek!H419","v":0},{"$f":"Wniosek!I177+Wniosek!I298+Wniosek!I419","v":0}]
[{"$f":"Wniosek!A45","v":11},{"$f":"Wniosek!B45","v":0},{"$f":"Wniosek!C178+Wniosek!C299+Wniosek!C420","v":0},{"$f":"Wniosek!E178+Wniosek!E299+Wniosek!E420","v":0},0,{"$f":"Wniosek!H178+Wniosek!H299+Wniosek!H420","v":0},{"$f":"Wniosek!I178+Wniosek!I299+Wniosek!I420","v":0}]
[{"$f":"Wniosek!A46","v":12},{"$f":"Wniosek!B46","v":0},{"$f":"Wniosek!C179+Wniosek!C300+Wniosek!C421","v":0},{"$f":"Wniosek!E179+Wniosek!E300+Wniosek!E421","v":0},0,{"$f":"Wniosek!H179+Wniosek!H300+Wniosek!H421","v":0},{"$f":"Wniosek!I179+Wniosek!I300+Wniosek!I421","v":0}]
[{"$f":"Wniosek!A47","v":13},{"$f":"Wniosek!B47","v":0},{"$f":"Wniosek!C180+Wniosek!C301+Wniosek!C422","v":0},{"$f":"Wniosek!E180+Wniosek!E301+Wniosek!E422","v":0},0,{"$f":"Wniosek!H180+Wniosek!H301+Wniosek!H422","v":0},{"$f":"Wniosek!I180+Wniosek!I301+Wniosek!I422","v":0}]
[{"$f":"Wniosek!A48","v":14},{"$f":"Wniosek!B48","v":0},{"$f":"Wniosek!C181+Wniosek!C302+Wniosek!C423","v":0},{"$f":"Wniosek!E181+Wniosek!E302+Wniosek!E423","v":0},0,{"$f":"Wniosek!H181+Wniosek!H302+Wniosek!H423","v":0},{"$f":"Wniosek!I181+Wniosek!I302+Wniosek!I423","v":0}]
[{"$f":"Wniosek!A49","v":15},{"$f":"Wniosek!B49","v":0},{"$f":"Wniosek!C182+Wniosek!C303+Wniosek!C424","v":0},{"$f":"Wniosek!E182+Wniosek!E303+Wniosek!E424","v":0},0,{"$f":"Wniosek!H182+Wniosek!H303+Wniosek!H424","v":0},{"$f":"Wniosek!I182+Wniosek!I303+Wniosek!I424","v":0}]
[{"$f":"Wniosek!A50","v":16},{"$f":"Wniosek!B50","v":0},{"$f":"Wniosek!C183+Wniosek!C304+Wniosek!C425","v":0},{"$f":"Wniosek!E183+Wniosek!E304+Wniosek!E425","v":0},0,{"$f":"Wniosek!H183+Wniosek!H304+Wniosek!H425","v":0},{"$f":"Wniosek!I183+Wniosek!I304+Wniosek!I425","v":0}]
[{"$f":"Wniosek!A51","v":17},{"$f":"Wniosek!B51","v":0},{"$f":"Wniosek!C184+Wniosek!C305+Wniosek!C426","v":0},{"$f":"Wniosek!E184+Wniosek!E305+Wniosek!E426","v":0},0,{"$f":"Wniosek!H184+Wniosek!H305+Wniosek!H426","v":0},{"$f":"Wniosek!I184+Wniosek!I305+Wniosek!I426","v":0}]
[{"$f":"Wniosek!A52","v":18},{"$f":"Wniosek!B52","v":0},{"$f":"Wniosek!C185+Wniosek!C306+Wniosek!C427","v":0},{"$f":"Wniosek!E185+Wniosek!E306+Wniosek!E427","v":0},0,{"$f":"Wniosek!H185+Wniosek!H306+Wniosek!H427","v":0},{"$f":"Wniosek!I185+Wniosek!I306+Wniosek!I427","v":0}]
[{"$f":"Wniosek!A53","v":19},{"$f":"Wniosek!B53","v":0},{"$f":"Wniosek!C186+Wniosek!C307+Wniosek!C428","v":0},{"$f":"Wniosek!E186+Wniosek!E307+Wniosek!E428","v":0},0,{"$f":"Wniosek!H186+Wniosek!H307+Wniosek!H428","v":0},{"$f":"Wniosek!I186+Wniosek!I307+Wniosek!I428","v":0}]
[{"$f":"Wniosek!A54","v":20},{"$f":"Wniosek!B54","v":0},{"$f":"Wniosek!C187+Wniosek!C308+Wniosek!C429","v":0},{"$f":"Wniosek!E187+Wniosek!E308+Wniosek!E429","v":0},0,{"$f":"Wniosek!H187+Wniosek!H308+Wniosek!H429","v":0},{"$f":"Wniosek!I187+Wniosek!I308+Wniosek!I429","v":0}]
[{"$f":"Wniosek!A55","v":21},{"$f":"Wniosek!B55","v":0},{"$f":"Wniosek!C188+Wniosek!C309+Wniosek!C430","v":0},{"$f":"Wniosek!E188+Wniosek!E309+Wniosek!E430","v":0},0,{"$f":"Wniosek!H188+Wniosek!H309+Wniosek!H430","v":0},{"$f":"Wniosek!I188+Wniosek!I309+Wniosek!I430","v":0}]
[{"$f":"Wniosek!A56","v":22},{"$f":"Wniosek!B56","v":0},{"$f":"Wniosek!C189+Wniosek!C310+Wniosek!C431","v":0},{"$f":"Wniosek!E189+Wniosek!E310+Wniosek!E431","v":0},0,{"$f":"Wniosek!H189+Wniosek!H310+Wniosek!H431","v":0},{"$f":"Wniosek!I189+Wniosek!I310+Wniosek!I431","v":0}]
[{"$f":"Wniosek!A57","v":23},{"$f":"Wniosek!B57","v":0},{"$f":"Wniosek!C190+Wniosek!C311+Wniosek!C432","v":0},{"$f":"Wniosek!E190+Wniosek!E311+Wniosek!E432","v":0},0,{"$f":"Wniosek!H190+Wniosek!H311+Wniosek!H432","v":0},{"$f":"Wniosek!I190+Wniosek!I311+Wniosek!I432","v":0}]
[{"$f":"Wniosek!A58","v":24},{"$f":"Wniosek!B58","v":0},{"$f":"Wniosek!C191+Wniosek!C312+Wniosek!C433","v":0},{"$f":"Wniosek!E191+Wniosek!E312+Wniosek!E433","v":0},0,{"$f":"Wniosek!H191+Wniosek!H312+Wniosek!H433","v":0},{"$f":"Wniosek!I191+Wniosek!I312+Wniosek!I433","v":0}]
[{"$f":"Wniosek!A59","v":25},{"$f":"Wniosek!B59","v":0},{"$f":"Wniosek!C192+Wniosek!C313+Wniosek!C434","v":0},{"$f":"Wniosek!E192+Wniosek!E313+Wniosek!E434","v":0},0,{"$f":"Wniosek!H192+Wniosek!H313+Wniosek!H434","v":0},{"$f":"Wniosek!I192+Wniosek!I313+Wniosek!I434","v":0}]
[{"$f":"Wniosek!A60","v":26},{"$f":"Wniosek!B60","v":0},{"$f":"Wniosek!C193+Wniosek!C314+Wniosek!C435","v":0},{"$f":"Wniosek!E193+Wniosek!E314+Wniosek!E435","v":0},0,{"$f":"Wniosek!H193+Wniosek!H314+Wniosek!H435","v":0},{"$f":"Wniosek!I193+Wniosek!I314+Wniosek!I435","v":0}]
[{"$f":"Wniosek!A61","v":27},{"$f":"Wniosek!B61","v":0},{"$f":"Wniosek!C194+Wniosek!C315+Wniosek!C436","v":0},{"$f":"Wniosek!E194+Wniosek!E315+Wniosek!E436","v":0},0,{"$f":"Wniosek!H194+Wniosek!H315+Wniosek!H436","v":0},{"$f":"Wniosek!I194+Wniosek!I315+Wniosek!I436","v":0}]
[{"$f":"Wniosek!A62","v":28},{"$f":"Wniosek!B62","v":0},{"$f":"Wniosek!C195+Wniosek!C316+Wniosek!C437","v":0},{"$f":"Wniosek!E195+Wniosek!E316+Wniosek!E437","v":0},0,{"$f":"Wniosek!H195+Wniosek!H316+Wniosek!H437","v":0},{"$f":"Wniosek!I195+Wniosek!I316+Wniosek!I437","v":0}]
[{"$f":"Wniosek!A63","v":29},{"$f":"Wniosek!B63","v":0},{"$f":"Wniosek!C196+Wniosek!C317+Wniosek!C438","v":0},{"$f":"Wniosek!E196+Wniosek!E317+Wniosek!E438","v":0},0,{"$f":"Wniosek!H196+Wniosek!H317+Wniosek!H438","v":0},{"$f":"Wniosek!I196+Wniosek!I317+Wniosek!I438","v":0}]
[{"$f":"Wniosek!A64","v":30},{"$f":"Wniosek!B64","v":0},{"$f":"Wniosek!C197+Wniosek!C318+Wniosek!C439","v":0},{"$f":"Wniosek!E197+Wniosek!E318+Wniosek!E439","v":0},0,{"$f":"Wniosek!H197+Wniosek!H318+Wniosek!H439","v":0},{"$f":"Wniosek!I197+Wniosek!I318+Wniosek!I439","v":0}]
[{"$f":"Wniosek!A65","v":31},{"$f":"Wniosek!B65","v":0},{"$f":"Wniosek!C198+Wniosek!C319+Wniosek!C440","v":0},{"$f":"Wniosek!E198+Wniosek!E319+Wniosek!E440","v":0},0,{"$f":"Wniosek!H198+Wniosek!H319+Wniosek!H440","v":0},{"$f":"Wniosek!I198+Wniosek!I319+Wniosek!I440","v":0}]
[{"$f":"Wniosek!A66","v":32},{"$f":"Wniosek!B66","v":0},{"$f":"Wniosek!C199+Wniosek!C320+Wniosek!C441","v":0},{"$f":"Wniosek!E199+Wniosek!E320+Wniosek!E441","v":0},0,{"$f":"Wniosek!H199+Wniosek!H320+Wniosek!H441","v":0},{"$f":"Wniosek!I199+Wniosek!I320+Wniosek!I441","v":0}]
[{"$f":"Wniosek!A67","v":33},{"$f":"Wniosek!B67","v":0},{"$f":"Wniosek!C200+Wniosek!C321+Wniosek!C442","v":0},{"$f":"Wniosek!E200+Wniosek!E321+Wniosek!E442","v":0},0,{"$f":"Wniosek!H200+Wniosek!H321+Wniosek!H442","v":0},{"$f":"Wniosek!I200+Wniosek!I321+Wniosek!I442","v":0}]
[{"$f":"Wniosek!A68","v":34},{"$f":"Wniosek!B68","v":0},{"$f":"Wniosek!C201+Wniosek!C322+Wniosek!C443","v":0},{"$f":"Wniosek!E201+Wniosek!E322+Wniosek!E443","v":0},0,{"$f":"Wniosek!H201+Wniosek!H322+Wniosek!H443","v":0},{"$f":"Wniosek!I201+Wniosek!I322+Wniosek!I443","v":0}]
[{"$f":"Wniosek!A69","v":35},{"$f":"Wniosek!B69","v":0},{"$f":"Wniosek!C202+Wniosek!C323+Wniosek!C444","v":0},{"$f":"Wniosek!E202+Wniosek!E323+Wniosek!E444","v":0},0,{"$f":"Wniosek!H202+Wniosek!H323+Wniosek!H444","v":0},{"$f":"Wniosek!I202+Wniosek!I323+Wniosek!I444","v":0}]
[{"$f":"Wniosek!A70","v":36},{"$f":"Wniosek!B70","v":0},{"$f":"Wniosek!C203+Wniosek!C324+Wniosek!C445","v":0},{"$f":"Wniosek!E203+Wniosek!E324+Wniosek!E445","v":0},0,{"$f":"Wniosek!H203+Wniosek!H324+Wniosek!H445","v":0},{"$f":"Wniosek!I203+Wniosek!I324+Wniosek!I445","v":0}]
[{"$f":"Wniosek!A71","v":37},{"$f":"Wniosek!B71","v":0},{"$f":"Wniosek!C204+Wniosek!C325+Wniosek!C446","v":0},{"$f":"Wniosek!E204+Wniosek!E325+Wniosek!E446","v":0},0,{"$f":"Wniosek!H204+Wniosek!H325+Wniosek!H446","v":0},{"$f":"Wniosek!I204+Wniosek!I325+Wniosek!I446","v":0}]
[{"$f":"Wniosek!A72","v":38},{"$f":"Wniosek!B72","v":0},{"$f":"Wniosek!C205+Wniosek!C326+Wniosek!C447","v":0},{"$f":"Wniosek!E205+Wniosek!E326+Wniosek!E447","v":0},0,{"$f":"Wniosek!H205+Wniosek!H326+Wniosek!H447","v":0},{"$f":"Wniosek!I205+Wniosek!I326+Wniosek!I447","v":0}]
[{"$f":"Wniosek!A73","v":39},{"$f":"Wniosek!B73","v":0},{"$f":"Wniosek!C206+Wniosek!C327+Wniosek!C448","v":0},{"$f":"Wniosek!E206+Wniosek!E327+Wniosek!E448","v":0},0,{"$f":"Wniosek!H206+Wniosek!H327+Wniosek!H448","v":0},{"$f":"Wniosek!I206+Wniosek!I327+Wniosek!I448","v":0}]
[{"$f":"Wniosek!A74","v":40},{"$f":"Wniosek!B74","v":0},{"$f":"Wniosek!C207+Wniosek!C328+Wniosek!C449","v":0},{"$f":"Wniosek!E207+Wniosek!E328+Wniosek!E449","v":0},0,{"$f":"Wniosek!H207+Wniosek!H328+Wniosek!H449","v":0},{"$f":"Wniosek!I207+Wniosek!I328+Wniosek!I449","v":0}]
[{"$f":"Wniosek!A75","v":41},{"$f":"Wniosek!B75","v":0},{"$f":"Wniosek!C208+Wniosek!C329+Wniosek!C450","v":0},{"$f":"Wniosek!E208+Wniosek!E329+Wniosek!E450","v":0},0,{"$f":"Wniosek!H208+Wniosek!H329+Wniosek!H450","v":0},{"$f":"Wniosek!I208+Wniosek!I329+Wniosek!I450","v":0}]
[{"$f":"Wniosek!A76","v":42},{"$f":"Wniosek!B76","v":0},{"$f":"Wniosek!C209+Wniosek!C330+Wniosek!C451","v":0},{"$f":"Wniosek!E209+Wniosek!E330+Wniosek!E451","v":0},0,{"$f":"Wniosek!H209+Wniosek!H330+Wniosek!H451","v":0},{"$f":"Wniosek!I209+Wniosek!I330+Wniosek!I451","v":0}]
[{"$f":"Wniosek!A77","v":43},{"$f":"Wniosek!B77","v":0},{"$f":"Wniosek!C210+Wniosek!C331+Wniosek!C452","v":0},{"$f":"Wniosek!E210+Wniosek!E331+Wniosek!E452","v":0},0,{"$f":"Wniosek!H210+Wniosek!H331+Wniosek!H452","v":0},{"$f":"Wniosek!I210+Wniosek!I331+Wniosek!I452","v":0}]
[{"$f":"Wniosek!A78","v":44},{"$f":"Wniosek!B78","v":0},{"$f":"Wniosek!C211+Wniosek!C332+Wniosek!C453","v":0},{"$f":"Wniosek!E211+Wniosek!E332+Wniosek!E453","v":0},0,{"$f":"Wniosek!H211+Wniosek!H332+Wniosek!H453","v":0},{"$f":"Wniosek!I211+Wniosek!I332+Wniosek!I453","v":0}]
[{"$f":"Wniosek!A79","v":45},{"$f":"Wniosek!B79","v":0},{"$f":"Wniosek!C212+Wniosek!C333+Wniosek!C454","v":0},{"$f":"Wniosek!E212+Wniosek!E333+Wniosek!E454","v":0},0,{"$f":"Wniosek!H212+Wniosek!H333+Wniosek!H454","v":0},{"$f":"Wniosek!I212+Wniosek!I333+Wniosek!I454","v":0}]
[{"$f":"Wniosek!A80","v":46},{"$f":"Wniosek!B80","v":0},{"$f":"Wniosek!C213+Wniosek!C334+Wniosek!C455","v":0},{"$f":"Wniosek!E213+Wniosek!E334+Wniosek!E455","v":0},0,{"$f":"Wniosek!H213+Wniosek!H334+Wniosek!H455","v":0},{"$f":"Wniosek!I213+Wniosek!I334+Wniosek!I455","v":0}]
[{"$f":"Wniosek!A81","v":47},{"$f":"Wniosek!B81","v":0},{"$f":"Wniosek!C214+Wniosek!C335+Wniosek!C456","v":0},{"$f":"Wniosek!E214+Wniosek!E335+Wniosek!E456","v":0},0,{"$f":"Wniosek!H214+Wniosek!H335+Wniosek!H456","v":0},{"$f":"Wniosek!I214+Wniosek!I335+Wniosek!I456","v":0}]
[{"$f":"Wniosek!A82","v":48},{"$f":"Wniosek!B82","v":0},{"$f":"Wniosek!C215+Wniosek!C336+Wniosek!C457","v":0},{"$f":"Wniosek!E215+Wniosek!E336+Wniosek!E457","v":0},0,{"$f":"Wniosek!H215+Wniosek!H336+Wniosek!H457","v":0},{"$f":"Wniosek!I215+Wniosek!I336+Wniosek!I457","v":0}]
[{"$f":"Wniosek!A83","v":49},{"$f":"Wniosek!B83","v":0},{"$f":"Wniosek!C216+Wniosek!C337+Wniosek!C458","v":0},{"$f":"Wniosek!E216+Wniosek!E337+Wniosek!E458","v":0},0,{"$f":"Wniosek!H216+Wniosek!H337+Wniosek!H458","v":0},{"$f":"Wniosek!I216+Wniosek!I337+Wniosek!I458","v":0}]
[{"$f":"Wniosek!A84","v":50},{"$f":"Wniosek!B84","v":0},{"$f":"Wniosek!C217+Wniosek!C338+Wniosek!C459","v":0},{"$f":"Wniosek!E217+Wniosek!E338+Wniosek!E459","v":0},0,{"$f":"Wniosek!H217+Wniosek!H338+Wniosek!H459","v":0},{"$f":"Wniosek!I217+Wniosek!I338+Wniosek!I459","v":0}]
[{"$f":"Wniosek!A85","v":51},{"$f":"Wniosek!B85","v":0},{"$f":"Wniosek!C218+Wniosek!C339+Wniosek!C460","v":0},{"$f":"Wniosek!E218+Wniosek!E339+Wniosek!E460","v":0},0,{"$f":"Wniosek!H218+Wniosek!H339+Wniosek!H460","v":0},{"$f":"Wniosek!I218+Wniosek!I339+Wniosek!I460","v":0}]
[{"$f":"Wniosek!A86","v":52},{"$f":"Wniosek!B86","v":0},{"$f":"Wniosek!C219+Wniosek!C340+Wniosek!C461","v":0},{"$f":"Wniosek!E219+Wniosek!E340+Wniosek!E461","v":0},0,{"$f":"Wniosek!H219+Wniosek!H340+Wniosek!H461","v":0},{"$f":"Wniosek!I219+Wniosek!I340+Wniosek!I461","v":0}]
[{"$f":"Wniosek!A87","v":53},{"$f":"Wniosek!B87","v":0},{"$f":"Wniosek!C220+Wniosek!C341+Wniosek!C462","v":0},{"$f":"Wniosek!E220+Wniosek!E341+Wniosek!E462","v":0},0,{"$f":"Wniosek!H220+Wniosek!H341+Wniosek!H462","v":0},{"$f":"Wniosek!I220+Wniosek!I341+Wniosek!I462","v":0}]
[{"$f":"Wniosek!A88","v":54},{"$f":"Wniosek!B88","v":0},{"$f":"Wniosek!C221+Wniosek!C342+Wniosek!C463","v":0},{"$f":"Wniosek!E221+Wniosek!E342+Wniosek!E463","v":0},0,{"$f":"Wniosek!H221+Wniosek!H342+Wniosek!H463","v":0},{"$f":"Wniosek!I221+Wniosek!I342+Wniosek!I463","v":0}]
[{"$f":"Wniosek!A89","v":55},{"$f":"Wniosek!B89","v":0},{"$f":"Wniosek!C222+Wniosek!C343+Wniosek!C464","v":0},{"$f":"Wniosek!E222+Wniosek!E343+Wniosek!E464","v":0},0,{"$f":"Wniosek!H222+Wniosek!H343+Wniosek!H464","v":0},{"$f":"Wniosek!I222+Wniosek!I343+Wniosek!I464","v":0}]
[{"$f":"Wniosek!A90","v":56},{"$f":"Wniosek!B90","v":0},{"$f":"Wniosek!C223+Wniosek!C344+Wniosek!C465","v":0},{"$f":"Wniosek!E223+Wniosek!E344+Wniosek!E465","v":0},0,{"$f":"Wniosek!H223+Wniosek!H344+Wniosek!H465","v":0},{"$f":"Wniosek!I223+Wniosek!I344+Wniosek!I465","v":0}]
[{"$f":"Wniosek!A91","v":57},{"$f":"Wniosek!B91","v":0},{"$f":"Wniosek!C224+Wniosek!C345+Wniosek!C466","v":0},{"$f":"Wniosek!E224+Wniosek!E345+Wniosek!E466","v":0},0,{"$f":"Wniosek!H224+Wniosek!H345+Wniosek!H466","v":0},{"$f":"Wniosek!I224+Wniosek!I345+Wniosek!I466","v":0}]
[{"$f":"Wniosek!A92","v":58},{"$f":"Wniosek!B92","v":0},{"$f":"Wniosek!C225+Wniosek!C346+Wniosek!C467","v":0},{"$f":"Wniosek!E225+Wniosek!E346+Wniosek!E467","v":0},0,{"$f":"Wniosek!H225+Wniosek!H346+Wniosek!H467","v":0},{"$f":"Wniosek!I225+Wniosek!I346+Wniosek!I467","v":0}]
[{"$f":"Wniosek!A93","v":59},{"$f":"Wniosek!B93","v":0},{"$f":"Wniosek!C226+Wniosek!C347+Wniosek!C468","v":0},{"$f":"Wniosek!E226+Wniosek!E347+Wniosek!E468","v":0},0,{"$f":"Wniosek!H226+Wniosek!H347+Wniosek!H468","v":0},{"$f":"Wniosek!I226+Wniosek!I347+Wniosek!I468","v":0}]
[{"$f":"Wniosek!A94","v":60},{"$f":"Wniosek!B94","v":0},{"$f":"Wniosek!C227+Wniosek!C348+Wniosek!C469","v":0},{"$f":"Wniosek!E227+Wniosek!E348+Wniosek!E469","v":0},0,{"$f":"Wniosek!H227+Wniosek!H348+Wniosek!H469","v":0},{"$f":"Wniosek!I227+Wniosek!I348+Wniosek!I469","v":0}]
[{"$f":"Wniosek!A95","v":61},{"$f":"Wniosek!B95","v":0},{"$f":"Wniosek!C228+Wniosek!C349+Wniosek!C470","v":0},{"$f":"Wniosek!E228+Wniosek!E349+Wniosek!E470","v":0},0,{"$f":"Wniosek!H228+Wniosek!H349+Wniosek!H470","v":0},{"$f":"Wniosek!I228+Wniosek!I349+Wniosek!I470","v":0}]
[{"$f":"Wniosek!A96","v":62},{"$f":"Wniosek!B96","v":0},{"$f":"Wniosek!C229+Wniosek!C350+Wniosek!C471","v":0},{"$f":"Wniosek!E229+Wniosek!E350+Wniosek!E471","v":0},0,{"$f":"Wniosek!H229+Wniosek!H350+Wniosek!H471","v":0},{"$f":"Wniosek!I229+Wniosek!I350+Wniosek!I471","v":0}]
[{"$f":"Wniosek!A97","v":63},{"$f":"Wniosek!B97","v":0},{"$f":"Wniosek!C230+Wniosek!C351+Wniosek!C472","v":0},{"$f":"Wniosek!E230+Wniosek!E351+Wniosek!E472","v":0},0,{"$f":"Wniosek!H230+Wniosek!H351+Wniosek!H472","v":0},{"$f":"Wniosek!I230+Wniosek!I351+Wniosek!I472","v":0}]
[{"$f":"Wniosek!A98","v":64},{"$f":"Wniosek!B98","v":0},{"$f":"Wniosek!C231+Wniosek!C352+Wniosek!C473","v":0},{"$f":"Wniosek!E231+Wniosek!E352+Wniosek!E473","v":0},0,{"$f":"Wniosek!H231+Wniosek!H352+Wniosek!H473","v":0},{"$f":"Wniosek!I231+Wniosek!I352+Wniosek!I473","v":0}]
[{"$f":"Wniosek!A99","v":65},{"$f":"Wniosek!B99","v":0},{"$f":"Wniosek!C232+Wniosek!C353+Wniosek!C474","v":0},{"$f":"Wniosek!E232+Wniosek!E353+Wniosek!E474","v":0},0,{"$f":"Wniosek!H232+Wniosek!H353+Wniosek!H474","v":0},{"$f":"Wniosek!I232+Wniosek!I353+Wniosek!I474","v":0}]
[{"$f":"Wniosek!A100","v":66},{"$f":"Wniosek!B100","v":0},{"$f":"Wniosek!C233+Wniosek!C354+Wniosek!C475","v":0},{"$f":"Wniosek!E233+Wniosek!E354+Wniosek!E475","v":0},{"$f":"IFERROR(F67/D67,0)","v":0},{"$f":"Wniosek!H233+Wniosek!H354+Wniosek!H475","v":0},{"$f":"Wniosek!I233+Wniosek!I354+Wniosek!I475","v":0}]
[{"$f":"Wniosek!A101","v":67},{"$f":"Wniosek!B101","v":0},{"$f":"Wniosek!C234+Wniosek!C355+Wniosek!C476","v":0},{"$f":"Wniosek!E234+Wniosek!E355+Wniosek!E476","v":0},0,{"$f":"Wniosek!H234+Wniosek!H355+Wniosek!H476","v":0},{"$f":"Wniosek!I234+Wniosek!I355+Wniosek!I476","v":0}]
[{"$f":"Wniosek!A102","v":68},{"$f":"Wniosek!B102","v":0},{"$f":"Wniosek!C235+Wniosek!C356+Wniosek!C477","v":0},{"$f":"Wniosek!E235+Wniosek!E356+Wniosek!E477","v":0},0,{"$f":"Wniosek!H235+Wniosek!H356+Wniosek!H477","v":0},{"$f":"Wniosek!I235+Wniosek!I356+Wniosek!I477","v":0}]
[{"$f":"Wniosek!A103","v":69},{"$f":"Wniosek!B103","v":0},{"$f":"Wniosek!C236+Wniosek!C357+Wniosek!C478","v":0},{"$f":"Wniosek!E236+Wniosek!E357+Wniosek!E478","v":0},0,{"$f":"Wniosek!H236+Wniosek!H357+Wniosek!H478","v":0},{"$f":"Wniosek!I236+Wniosek!I357+Wniosek!I478","v":0}]
[{"$f":"Wniosek!A104","v":70},{"$f":"Wniosek!B104","v":0},{"$f":"Wniosek!C237+Wniosek!C358+Wniosek!C479","v":0},{"$f":"Wniosek!E237+Wniosek!E358+Wniosek!E479","v":0},0,{"$f":"Wniosek!H237+Wniosek!H358+Wniosek!H479","v":0},{"$f":"Wniosek!I237+Wniosek!I358+Wniosek!I479","v":0}]
[{"$f":"Wniosek!A105","v":71},{"$f":"Wniosek!B105","v":0},{"$f":"Wniosek!C238+Wniosek!C359+Wniosek!C480","v":0},{"$f":"Wniosek!E238+Wniosek!E359+Wniosek!E480","v":0},0,{"$f":"Wniosek!H238+Wniosek!H359+Wniosek!H480","v":0},{"$f":"Wniosek!I238+Wniosek!I359+Wniosek!I480","v":0}]
[{"$f":"Wniosek!A106","v":72},{"$f":"Wniosek!B106","v":0},{"$f":"Wniosek!C239+Wniosek!C360+Wniosek!C481","v":0},{"$f":"Wniosek!E239+Wniosek!E360+Wniosek!E481","v":0},0,{"$f":"Wniosek!H239+Wniosek!H360+Wniosek!H481","v":0},{"$f":"Wniosek!I239+Wniosek!I360+Wniosek!I481","v":0}]
[{"$f":"Wniosek!A107","v":73},{"$f":"Wniosek!B107","v":0},{"$f":"Wniosek!C240+Wniosek!C361+Wniosek!C482","v":0},{"$f":"Wniosek!E240+Wniosek!E361+Wniosek!E482","v":0},0,{"$f":"Wniosek!H240+Wniosek!H361+Wniosek!H482","v":0},{"$f":"Wniosek!I240+Wniosek!I361+Wniosek!I482","v":0}]
[{"$f":"Wniosek!A108","v":74},{"$f":"Wniosek!B108","v":0},{"$f":"Wniosek!C241+Wniosek!C362+Wniosek!C483","v":0},{"$f":"Wniosek!E241+Wniosek!E362+Wniosek!E483","v":0},0,{"$f":"Wniosek!H241+Wniosek!H362+Wniosek!H483","v":0},{"$f":"Wniosek!I241+Wniosek!I362+Wniosek!I483","v":0}]
[{"$f":"Wniosek!A109","v":75},{"$f":"Wniosek!B109","v":0},{"$f":"Wniosek!C242+Wniosek!C363+Wniosek!C484","v":0},{"$f":"Wniosek!E242+Wniosek!E363+Wniosek!E484","v":0},0,{"$f":"Wniosek!H242+Wniosek!H363+Wniosek!H484","v":0},{"$f":"Wniosek!I242+Wniosek!I363+Wniosek!I484","v":0}]
[{"$f":"Wniosek!A110","v":76},{"$f":"Wniosek!B110","v":0},{"$f":"Wniosek!C243+Wniosek!C364+Wniosek!C485","v":0},{"$f":"Wniosek!E243+Wniosek!E364+Wniosek!E485","v":0},0,{"$f":"Wniosek!H243+Wniosek!H364+Wniosek!H485","v":0},{"$f":"Wniosek!I243+Wniosek!I364+Wniosek!I485","v":0}]
[{"$f":"Wniosek!A111","v":77},{"$f":"Wniosek!B111","v":0},{"$f":"Wniosek!C244+Wniosek!C365+Wniosek!C486","v":0},{"$f":"Wniosek!E244+Wniosek!E365+Wniosek!E486","v":0},0,{"$f":"Wniosek!H244+Wniosek!H365+Wniosek!H486","v":0},{"$f":"Wniosek!I244+Wniosek!I365+Wniosek!I486","v":0}]
[{"$f":"Wniosek!A112","v":78},{"$f":"Wniosek!B112","v":0},{"$f":"Wniosek!C245+Wniosek!C366+Wniosek!C487","v":0},{"$f":"Wniosek!E245+Wniosek!E366+Wniosek!E487","v":0},0,{"$f":"Wniosek!H245+Wniosek!H366+Wniosek!H487","v":0},{"$f":"Wniosek!I245+Wniosek!I366+Wniosek!I487","v":0}]
[{"$f":"Wniosek!A113","v":79},{"$f":"Wniosek!B113","v":0},{"$f":"Wniosek!C246+Wniosek!C367+Wniosek!C488","v":0},{"$f":"Wniosek!E246+Wniosek!E367+Wniosek!E488","v":0},0,{"$f":"Wniosek!H246+Wniosek!H367+Wniosek!H488","v":0},{"$f":"Wniosek!I246+Wniosek!I367+Wniosek!I488","v":0}]
[{"$f":"Wniosek!A114","v":80},{"$f":"Wniosek!B114","v":0},{"$f":"Wniosek!C247+Wniosek!C368+Wniosek!C489","v":0},{"$f":"Wniosek!E247+Wniosek!E368+Wniosek!E489","v":0},0,{"$f":"Wniosek!H247+Wniosek!H368+Wniosek!H489","v":0},{"$f":"Wniosek!I247+Wniosek!I368+Wniosek!I489","v":0}]
[{"$f":"Wniosek!A115","v":81},{"$f":"Wniosek!B115","v":0},{"$f":"Wniosek!C248+Wniosek!C369+Wniosek!C490","v":0},{"$f":"Wniosek!E248+Wniosek!E369+Wniosek!E490","v":0},0,{"$f":"Wniosek!H248+Wniosek!H369+Wniosek!H490","v":0},{"$f":"Wniosek!I248+Wniosek!I369+Wniosek!I490","v":0}]
[{"$f":"Wniosek!A116","v":82},{"$f":"Wniosek!B116","v":0},{"$f":"Wniosek!C249+Wniosek!C370+Wniosek!C491","v":0},{"$f":"Wniosek!E249+Wniosek!E370+Wniosek!E491","v":0},0,{"$f":"Wniosek!H249+Wniosek!H370+Wniosek!H491","v":0},{"$f":"Wniosek!I249+Wniosek!I370+Wniosek!I491","v":0}]
[{"$f":"Wniosek!A117","v":83},{"$f":"Wniosek!B117","v":0},{"$f":"Wniosek!C250+Wniosek!C371+Wniosek!C492","v":0},{"$f":"Wniosek!E250+Wniosek!E371+Wniosek!E492","v":0},0,{"$f":"Wniosek!H250+Wniosek!H371+Wniosek!H492","v":0},{"$f":"Wniosek!I250+Wniosek!I371+Wniosek!I492","v":0}]
[{"$f":"Wniosek!A118","v":84},{"$f":"Wniosek!B118","v":0},{"$f":"Wniosek!C251+Wniosek!C372+Wniosek!C493","v":0},{"$f":"Wniosek!E251+Wniosek!E372+Wniosek!E493","v":0},0,{"$f":"Wniosek!H251+Wniosek!H372+Wniosek!H493","v":0},{"$f":"Wniosek!I251+Wniosek!I372+Wniosek!I493","v":0}]
[{"$f":"Wniosek!A119","v":85},{"$f":"Wniosek!B119","v":0},{"$f":"Wniosek!C252+Wniosek!C373+Wniosek!C494","v":0},{"$f":"Wniosek!E252+Wniosek!E373+Wniosek!E494","v":0},0,{"$f":"Wniosek!H252+Wniosek!H373+Wniosek!H494","v":0},{"$f":"Wniosek!I252+Wniosek!I373+Wniosek!I494","v":0}]
[{"$f":"Wniosek!A120","v":86},{"$f":"Wniosek!B120","v":0},{"$f":"Wniosek!C253+Wniosek!C374+Wniosek!C495","v":0},{"$f":"Wniosek!E253+Wniosek!E374+Wniosek!E495","v":0},0,{"$f":"Wniosek!H253+Wniosek!H374+Wniosek!H495","v":0},{"$f":"Wniosek!I253+Wniosek!I374+Wniosek!I495","v":0}]
[{"$f":"Wniosek!A121","v":87},{"$f":"Wniosek!B121","v":0},{"$f":"Wniosek!C254+Wniosek!C375+Wniosek!C496","v":0},{"$f":"Wniosek!E254+Wniosek!E375+Wniosek!E496","v":0},0,{"$f":"Wniosek!H254+Wniosek!H375+Wniosek!H496","v":0},{"$f":"Wniosek!I254+Wniosek!I375+Wniosek!I496","v":0}]
[{"$f":"Wniosek!A122","v":88},{"$f":"Wniosek!B122","v":0},{"$f":"Wniosek!C255+Wniosek!C376+Wniosek!C497","v":0},{"$f":"Wniosek!E255+Wniosek!E376+Wniosek!E497","v":0},0,{"$f":"Wniosek!H255+Wniosek!H376+Wniosek!H497","v":0},{"$f":"Wniosek!I255+Wniosek!I376+Wniosek!I497","v":0}]
[{"$f":"Wniosek!A123","v":89},{"$f":"Wniosek!B123","v":0},{"$f":"Wniosek!C256+Wniosek!C377+Wniosek!C498","v":0},{"$f":"Wniosek!E256+Wniosek!E377+Wniosek!E498","v":0},0,{"$f":"Wniosek!H256+Wniosek!H377+Wniosek!H498","v":0},{"$f":"Wniosek!I256+Wniosek!I377+Wniosek!I498","v":0}]
[{"$f":"Wniosek!A124","v":90},{"$f":"Wniosek!B124","v":0},{"$f":"Wniosek!C257+Wniosek!C378+Wniosek!C499","v":0},{"$f":"Wniosek!E257+Wniosek!E378+Wniosek!E499","v":0},0,{"$f":"Wniosek!H257+Wniosek!H378+Wniosek!H499","v":0},{"$f":"Wniosek!I257+Wniosek!I378+Wniosek!I499","v":0}]
[{"$f":"Wniosek!A125","v":91},{"$f":"Wniosek!B125","v":0},{"$f":"Wniosek!C258+Wniosek!C379+Wniosek!C500","v":0},{"$f":"Wniosek!E258+Wniosek!E379+Wniosek!E500","v":0},0,{"$f":"Wniosek!H258+Wniosek!H379+Wniosek!H500","v":0},{"$f":"Wniosek!I258+Wniosek!I379+Wniosek!I500","v":0}]
[{"$f":"Wniosek!A126","v":92},{"$f":"Wniosek!B126","v":0},{"$f":"Wniosek!C259+Wniosek!C380+Wniosek!C501","v":0},{"$f":"Wniosek!E259+Wniosek!E380+Wniosek!E501","v":0},0,{"$f":"Wniosek!H259+Wniosek!H380+Wniosek!H501","v":0},{"$f":"Wniosek!I259+Wniosek!I380+Wniosek!I501","v":0}]
[{"$f":"Wniosek!A127","v":93},{"$f":"Wniosek!B127","v":0},{"$f":"Wniosek!C260+Wniosek!C381+Wniosek!C502","v":0},{"$f":"Wniosek!E260+Wniosek!E381+Wniosek!E502","v":0},0,{"$f":"Wniosek!H260+Wniosek!H381+Wniosek!H502","v":0},{"$f":"Wniosek!I260+Wniosek!I381+Wniosek!I502","v":0}]
[{"$f":"Wniosek!A128","v":94},{"$f":"Wniosek!B128","v":0},{"$f":"Wniosek!C261+Wniosek!C382+Wniosek!C503","v":0},{"$f":"Wniosek!E261+Wniosek!E382+Wniosek!E503","v":0},0,{"$f":"Wniosek!H261+Wniosek!H382+Wniosek!H503","v":0},{"$f":"Wniosek!I261+Wniosek!I382+Wniosek!I503","v":0}]
[{"$f":"Wniosek!A129","v":95},{"$f":"Wniosek!B129","v":0},{"$f":"Wniosek!C262+Wniosek!C383+Wniosek!C504","v":0},{"$f":"Wniosek!E262+Wniosek!E383+Wniosek!E504","v":0},0,{"$f":"Wniosek!H262+Wniosek!H383+Wniosek!H504","v":0},{"$f":"Wniosek!I262+Wniosek!I383+Wniosek!I504","v":0}]
[{"$f":"Wniosek!A130","v":96},{"$f":"Wniosek!B130","v":0},{"$f":"Wniosek!C263+Wniosek!C384+Wniosek!C505","v":0},{"$f":"Wniosek!E263+Wniosek!E384+Wniosek!E505","v":0},0,{"$f":"Wniosek!H263+Wniosek!H384+Wniosek!H505","v":0},{"$f":"Wniosek!I263+Wniosek!I384+Wniosek!I505","v":0}]
[{"$f":"Wniosek!A131","v":97},{"$f":"Wniosek!B131","v":0},{"$f":"Wniosek!C264+Wniosek!C385+Wniosek!C506","v":0},{"$f":"Wniosek!E264+Wniosek!E385+Wniosek!E506","v":0},0,{"$f":"Wniosek!H264+Wniosek!H385+Wniosek!H506","v":0},{"$f":"Wniosek!I264+Wniosek!I385+Wniosek!I506","v":0}]
[{"$f":"Wniosek!A132","v":98},{"$f":"Wniosek!B132","v":0},{"$f":"Wniosek!C265+Wniosek!C386+Wniosek!C507","v":0},{"$f":"Wniosek!E265+Wniosek!E386+Wniosek!E507","v":0},0,{"$f":"Wniosek!H265+Wniosek!H386+Wniosek!H507","v":0},{"$f":"Wniosek!I265+Wniosek!I386+Wniosek!I507","v":0}]
[{"$f":"Wniosek!A133","v":99},{"$f":"Wniosek!B133","v":0},{"$f":"Wniosek!C266+Wniosek!C387+Wniosek!C508","v":0},{"$f":"Wniosek!E266+Wniosek!E387+Wniosek!E508","v":0},0,{"$f":"Wniosek!H266+Wniosek!H387+Wniosek!H508","v":0},{"$f":"Wniosek!I266+Wniosek!I387+Wniosek!I508","v":0}]
[{"$f":"Wniosek!A134","v":100},{"$f":"Wniosek!B134","v":0},{"$f":"Wniosek!C267+Wniosek!C388+Wniosek!C509","v":0},{"$f":"Wniosek!E267+Wniosek!E388+Wniosek!E509","v":0},0,{"$f":"Wniosek!H267+Wniosek!H388+Wniosek!H509","v":0},{"$f":"Wniosek!I267+Wniosek!I388+Wniosek!I509","v":0}]
[{"$f":"Wniosek!A135","v":101},{"$f":"Wniosek!B135","v":0},{"$f":"Wniosek!C268+Wniosek!C389+Wniosek!C510","v":0},{"$f":"Wniosek!E268+Wniosek!E389+Wniosek!E510","v":0},0,{"$f":"Wniosek!H268+Wniosek!H389+Wniosek!H510","v":0},{"$f":"Wniosek!I268+Wniosek!I389+Wniosek!I510","v":0}]
[{"$f":"Wniosek!A136","v":102},{"$f":"Wniosek!B136","v":0},{"$f":"Wniosek!C269+Wniosek!C390+Wniosek!C511","v":0},{"$f":"Wniosek!E269+Wniosek!E390+Wniosek!E511","v":0},0,{"$f":"Wniosek!H269+Wniosek!H390+Wniosek!H511","v":0},{"$f":"Wniosek!I269+Wniosek!I390+Wniosek!I511","v":0}]
[{"$f":"Wniosek!A137","v":103},{"$f":"Wniosek!B137","v":0},{"$f":"Wniosek!C270+Wniosek!C391+Wniosek!C512","v":0},{"$f":"Wniosek!E270+Wniosek!E391+Wniosek!E512","v":0},0,{"$f":"Wniosek!H270+Wniosek!H391+Wniosek!H512","v":0},{"$f":"Wniosek!I270+Wniosek!I391+Wniosek!I512","v":0}]
[{"$f":"Wniosek!A138","v":104},{"$f":"Wniosek!B138","v":0},{"$f":"Wniosek!C271+Wniosek!C392+Wniosek!C513","v":0},{"$f":"Wniosek!E271+Wniosek!E392+Wniosek!E513","v":0},0,{"$f":"Wniosek!H271+Wniosek!H392+Wniosek!H513","v":0},{"$f":"Wniosek!I271+Wniosek!I392+Wniosek!I513","v":0}]
[{"$f":"Wniosek!A139","v":105},{"$f":"Wniosek!B139","v":0},{"$f":"Wniosek!C272+Wniosek!C393+Wniosek!C514","v":0},{"$f":"Wniosek!E272+Wniosek!E393+Wniosek!E514","v":0},0,{"$f":"Wniosek!H272+Wniosek!H393+Wniosek!H514","v":0},{"$f":"Wniosek!I272+Wniosek!I393+Wniosek!I514","v":0}]
[{"$f":"Wniosek!A140","v":106},{"$f":"Wniosek!B140","v":0},{"$f":"Wniosek!C273+Wniosek!C394+Wniosek!C515","v":0},{"$f":"Wniosek!E273+Wniosek!E394+Wniosek!E515","v":0},0,{"$f":"Wniosek!H273+Wniosek!H394+Wniosek!H515","v":0},{"$f":"Wniosek!I273+Wniosek!I394+Wniosek!I515","v":0}]
[{"$f":"Wniosek!A141","v":107},{"$f":"Wniosek!B141","v":0},{"$f":"Wniosek!C274+Wniosek!C395+Wniosek!C516","v":0},{"$f":"Wniosek!E274+Wniosek!E395+Wniosek!E516","v":0},0,{"$f":"Wniosek!H274+Wniosek!H395+Wniosek!H516","v":0},{"$f":"Wniosek!I274+Wniosek!I395+Wniosek!I516","v":0}]
[{"$f":"Wniosek!A142","v":108},{"$f":"Wniosek!B142","v":0},{"$f":"Wniosek!C275+Wniosek!C396+Wniosek!C517","v":0},{"$f":"Wniosek!E275+Wniosek!E396+Wniosek!E517","v":0},0,{"$f":"Wniosek!H275+Wniosek!H396+Wniosek!H517","v":0},{"$f":"Wniosek!I275+Wniosek!I396+Wniosek!I517","v":0}]
[{"$f":"Wniosek!A143","v":109},{"$f":"Wniosek!B143","v":0},{"$f":"Wniosek!C276+Wniosek!C397+Wniosek!C518","v":0},{"$f":"Wniosek!E276+Wniosek!E397+Wniosek!E518","v":0},0,{"$f":"Wniosek!H276+Wniosek!H397+Wniosek!H518","v":0},{"$f":"Wniosek!I276+Wniosek!I397+Wniosek!I518","v":0}]
[{"$f":"Wniosek!A144","v":110},{"$f":"Wniosek!B144","v":0},{"$f":"Wniosek!C277+Wniosek!C398+Wniosek!C519","v":0},{"$f":"Wniosek!E277+Wniosek!E398+Wniosek!E519","v":0},0,{"$f":"Wniosek!H277+Wniosek!H398+Wniosek!H519","v":0},{"$f":"Wniosek!I277+Wniosek!I398+Wniosek!I519","v":0}]
[{"$f":"Wniosek!A145","v":111},{"$f":"Wniosek!B145","v":0},{"$f":"Wniosek!C278+Wniosek!C399+Wniosek!C520","v":0},{"$f":"Wniosek!E278+Wniosek!E399+Wniosek!E520","v":0},0,{"$f":"Wniosek!H278+Wniosek!H399+Wniosek!H520","v":0},{"$f":"Wniosek!I278+Wniosek!I399+Wniosek!I520","v":0}]
[{"$f":"Wniosek!A146","v":112},{"$f":"Wniosek!B146","v":0},{"$f":"Wniosek!C279+Wniosek!C400+Wniosek!C521","v":0},{"$f":"Wniosek!E279+Wniosek!E400+Wniosek!E521","v":0},0,{"$f":"Wniosek!H279+Wniosek!H400+Wniosek!H521","v":0},{"$f":"Wniosek!I279+Wniosek!I400+Wniosek!I521","v":0}]
[{"$f":"Wniosek!A147","v":113},{"$f":"Wniosek!B147","v":0},{"$f":"Wniosek!C280+Wniosek!C401+Wniosek!C522","v":0},{"$f":"Wniosek!E280+Wniosek!E401+Wniosek!E522","v":0},0,{"$f":"Wniosek!H280+Wniosek!H401+Wniosek!H522","v":0},{"$f":"Wniosek!I280+Wniosek!I401+Wniosek!I522","v":0}]
[{"$f":"Wniosek!A148","v":114},{"$f":"Wniosek!B148","v":0},{"$f":"Wniosek!C281+Wniosek!C402+Wniosek!C523","v":0},{"$f":"Wniosek!E281+Wniosek!E402+Wniosek!E523","v":0},0,{"$f":"Wniosek!H281+Wniosek!H402+Wniosek!H523","v":0},{"$f":"Wniosek!I281+Wniosek!I402+Wniosek!I523","v":0}]
[{"$f":"Wniosek!A149","v":115},{"$f":"Wniosek!B149","v":0},{"$f":"Wniosek!C282+Wniosek!C403+Wniosek!C524","v":0},{"$f":"Wniosek!E282+Wniosek!E403+Wniosek!E524","v":0},0,{"$f":"Wniosek!H282+Wniosek!H403+Wniosek!H524","v":0},{"$f":"Wniosek!I282+Wniosek!I403+Wniosek!I524","v":0}]

{"sheet":"MiR","index":11,"n_rows":2,"n_cols":4,"rows_kept":2,"cut":false,"hidden":true,"merged":[]}
[{"$f":"CONCATENATE(\"Wielkość pracy eksploatacyjnej \",\" \",Wniosek!E19)","v":"Wielkość pracy eksploatacyjnej  I KWARTAŁ"},{"$f":"CONCATENATE(\"Kwota wynikająca z wniosków organizatorów \",\" \",Wniosek!E19)","v":"Kwota wynikająca z wniosków organizatorów  I KWARTAŁ"},{"$f":"CONCATENATE(\"Liczba linii ujętych we wniosku \",\" \",Wniosek!E19)","v":"Liczba linii ujętych we wniosku  I KWARTAŁ"},{"$f":"CONCATENATE(\"Liczba operatorów objętych wnioskiem \",\" \",Wniosek!E19)","v":"Liczba operatorów objętych wnioskiem  I KWARTAŁ"}]
[{"$f":"Wniosek!C283+Wniosek!C404+Wniosek!C525","v":0},{"$f":"Wniosek!I283+Wniosek!I525+Wniosek!I404","v":0},{"$f":"Wniosek!G29","v":0},{"$f":"Wniosek!G28","v":0}]

{"sheet":"Dane JST","index":12,"n_rows":172,"n_cols":9,"rows_kept":172,"cut":false,"hidden":true,"merged":[]}
["Nr umowy","nip","regon","nazwa","Adres","Kod TERYT","Powiat","Dysponent","Data zawarcia"]
["805.4.56.2024",8231561524,"711582820","Gmina Bielany","ul. Słoneczna 2, 08-311 Bielany-Żyłaki","1429022","sokołowski","451","21.01.2025"]
["805.4.62.2024",7743211034,"611015626","Gmina Bodzanów","ul. Bankowa 7, 09-470 Bodzanów","1419023","płocki","353","21.01.2025"]
["805.4.30.2024",8371692723,"015891220","Gmina Brochów","Brochów 125, 05-088 Brochów","1428022","sochaczewski","443","21.01.2025"]
["805.4.20.2024",7743188737,"611015678","Gmina Brudzeń Duży","ul. Toruńska 2, 09-414 Brudzeń Duży","1419032","płocki","354","21.01.2025"]
["805.4.10.2024",7743138099,"611015709","Gmina Bulkowo","ul. Szkolna 1, 09-454 Bulkowo","1419042","płocki","355","21.01.2025"]
["805.4.27.2024",5321057650,"013268965","Gmina Celestynów","ul. Regucka 3, 05-430 Celestynów","1417032","otwocki","339","21.01.2025"]
["805.4.6.2024",7582157593,"550668226","Gmina Czarnia","Czarnia 41, 07-431 Czarnia","1415022","ostrołęcki","316","21.01.2025"]
["805.4.9.2024",8212551571,"711582121","Gmina Domanice","Domanice 52, 08-113 Domanice","1426012","siedlecki","422","21.01.2025"]
["805.4.32.2024",7743211258,"611015425","Gmina Gąbin","ul. Stary Rynek 16, 09-530 Gąbin","1419063","płocki","357","21.01.2025"]
["805.4.48.2024",9710659440,"611015922","Gmina Gostynin","ul. Rynek 26, 09-500 Gostynin","1404011","gostyniński","231","21.01.2025"]
["805.4.59.2024",4960241880,"030237523","Gmina Huszlew","Huszlew 77, 08-206 Huszlew","1410012","łosicki","269","21.01.2025"]
["805.4.17.2024",8371692427,"611015661","Gmina Iłów","ul. Płocka 2, 96-520 Iłów","1428032","sochaczewski","444","21.01.2025"]
["805.4.52.2024",8221020459,"711582687","Gmina Kołbiel","ul. Szkolna 1, 05-340 Kołbiel","1417052","otwocki","341","21.01.2025"]
["805.4.24.2024",8212392351,"711582486","Gmina Korczew","ul. ks. Stanisława Brzóski 20A, 08-108 Korczew","1426022","siedlecki","423","21.01.2025"]
["805.4.40.2024",8212394019,"711582463","Gmina Kotuń","ul. Siedlecka 56C, 08-130 Kotuń","1426032","siedlecki","424","21.01.2025"]
["805.4.60.2024",9482371307,"670223818","Gmina Kowala","ul. Marii Walewskiej 7, 26-624 Kowala-Stępocina","1425072","radomski","414","21.01.2025"]
["805.4.23.2024",4960249189,"030237405","Gmina Łosice","ul. Marszałka Józefa Piłsudskiego 6, 08-200 Łosice","1410023","łosicki","270","21.01.2025"]
["805.4.15.2024",8262037296,"711582322","Gmina Miastków Kościelny","ul. Rynek 6, 08-420 Miastków Kościelny","1403082","garwoliński","223","21.01.2025"]
["805.4.12.2024",8371692019,"750148354","Gmina Młodzieszyn","ul. Wyszogrodzka 25, 96-512 Młodzieszyn","1428042","sochaczewski","445","21.01.2025"]
["805.4.11.2024",7761615078,"611015773","Gmina Mochowo","ul. Sierpecka 2, 09-214 Mochowo","1427032","sierpecki","437","21.01.2025"]
["805.4.16.2024",8212529494,"711582492","Gmina Mokobody","ul. Plac Chreptowicza 25, 08-124 Mokobody","1426042","siedlecki","425","21.01.2025"]
["805.4.7.2024",8212364231,"711582457","Gmina Mordy","ul. Kilińskiego 9, 08-140 Mordy","1426053","siedlecki","426","21.01.2025"]
["805.4.18.2024",7743211324,"611015796","Gmina Nowy Duninów","ul. Osiedlowa 1, 09-505 Nowy Duninów","1419092","płocki","360","21.01.2025"]
["805.4.2.2024",4960248273,"030237629","Gmina Olszanka","Olszanka 37, 08-207 Olszanka","1410032","łosicki","271","21.01.2025"]
["805.4.29.2024",8261170716,"711582285","Gmina Osieck","ul. Rynek 1, 08-445 Osieck","1417063","otwocki","342","21.01.2025"]
["805.4.38.2024",9710664197,"611015810","Gmina Pacyna","ul. Wyzwolenia 7, 09-541 Pacyna","1404032","gostyniński","232","21.01.2025"]
["805.4.66.2024",8212433653,"711582523","Gmina Paprotnia","ul. 3 Maja 2, 08-107 Paprotnia","1426062","siedlecki","427","21.01.2025"]
["805.4.46.2024",8262037244,"711582345","Gmina Pilawa","al. Wyzwolenia 158, 08-440 Pilawa","1403103","garwoliński","225","21.01.2025"]
["805.4.49.2024",4960249522,"030237641","Gmina Platerów","ul. 3 Maja 5, 08-210 Platerów","1410042","łosicki","272","21.01.2025"]
["805.4.3.2024",1251627895,"711582693","Gmina Poświętne","ul. Krótka 1, 05-326 Poświętne","1434082","wołomiński","488","21.01.2025"]
["805.4.19.2024",8212389633,"711582569","Gmina Przesmyki","ul. 11 Listopada 13, 08-109 Przesmyki","1426072","siedlecki","428","21.01.2025"]
["805.4.26.2024",8231559680,"711582055","Gmina Repki","ul. Parkowa 7, 08-307 Repki","1429062","sokołowski","455","21.01.2025"]
["805.4.13.2024",8371692261,"750148466","Gmina Rybno","ul. Długa 20, 96-514 Rybno","1428062","sochaczewski","447","21.01.2025"]
["805.4.4.2024",4960206961,"030237687","Gmina Sarnaki","ul. Berka Joselewicza 3, 08-220 Sarnaki","1410052","łosicki","273","21.01.2025"]
["805.4.8.2024",7743213464,"611015997","Gmina Słupno","ul. Miszewska 8A, 09-472 Słupno","1419122","płocki","363","21.01.2025"]
["805.4.42.2024",8261144044,"711582300","Gmina Sobienie-Jeziory","ul. Garwolińska 16, 08-443 Sobienie-Jeziory","1417072","otwocki","343","21.01.2025"]
["805.4.25.2024",4960213725,"030237724","Gmina Stara Kornica","Stara Kornica 191, 08-205 Stara Kornica","1410062","łosicki","274","21.01.2025"]
["805.4.54.2024",7743186342,"611016040","Gmina Staroźreby","ul. Płocka 18, 09-440 Staroźreby","1419142","płocki","365","21.01.2025"]
["805.4.36.2024",9710662755,"611016070","Gmina Szczawin Kościelny","ul. Jana Pawła II 10, 09-550 Szczawin Kościelny","1404052","gostyniński","234","21.01.2025"]
["805.4.14.2024",7591743066,"450670114","Gmina Szulborze Wielkie","ul. Romantyczna 2, 07-324 Szulborze Wielkie","1416092","ostrowski","334","21.01.2025"]
["805.4.35.2024",8371695437,"750148532","Gmina Teresin","ul. Zielona 20, 96-515 Teresin","1428082","sochaczewski","449","21.01.2025"]
["805.4.33.2024",9482382481,"670224054","Gmina Wierzbica","ul. Kościuszki 73, 26-680 Wierzbica","1425112","radomski","418","21.01.2025"]
["805.4.21.2024",7743211407,"611015508","Gmina Wyszogród","ul. Rębowska 37, 09-450 Wyszogród","1419153","płocki","366","21.01.2025"]
["805.4.28.2024",7962959318,"670224077","Gmina Zakrzew","Zakrzew 51, 26-652 Zakrzew","1425132","radomski","420","21.01.2025"]
["805.4.34.2024",8212392687,"711582670","Gmina Zbuczyn","ul. Jana Pawła II 1, 08-106 Zbuczyn","1426132","siedlecki","434","21.01.2025"]
["805.4.58.2024",8262037238,"711582204","Gmina Żelechów","ul. Rynek 1, 08-430 Żelechów","1403143","garwoliński","229","21.01.2025"]
["805.4.41.2024",8262221226,"526980652","Związek Powiatowo - Gminny  \"Garwolińskie Przewozy Gminno - Powiatowe\"","ul. Mazowiecka 26, 08-400 Garwolin","1403","garwoliński","94475","21.01.2025"]
["805.4.8.2025",7591625622,"450670090","Gmina Boguty-Pianki","ul. Aleja Papieża Jana Pawła II 45, 07-325 Boguty-Pianki","1416032","ostrowski","328","22.12.2025"]
["805.4.21.2025",8231597203,"711582842","Gmina Ceranów","Ceranów 140, 08-322 Ceranów","1429032","sokołowski","452","22.12.2025"]
["805.4.6.2025",7582349619,"550668210","Gmina Czerwin","pl. plac Tysiąclecia 1, 07-407 Czerwin","1415032","ostrołęcki","317","22.12.2025"]
["805.4.26.2025",5671851791,"611015715","Gmina Czerwińsk nad Wisłą","ul. Władysława Jagiełły 16, 09-150 Czerwińsk nad Wisłą","1420043","płoński","370","22.12.2025"]
["805.4.9.2025",5311664650,"013270413","Gmina Czosnów","ul. Gminna 6, 05-152 Czosnów","1414022","nowodworski","309","22.12.2025"]
["805.4.35.2025",1251334785,"550667971","Gmina Dąbrówka","ul. Tadeusza Kościuszki 14, 05-252 Dąbrówka","1434052","wołomiński","485","22.12.2025"]
["805.4.55.2025",7621918666,"550668114","Gmina Długosiodło","ul. Tadeusza Kościuszki 2, 07-210 Długosiodło","1435022","wyszkowski","494","22.12.2025"]
["805.4.10.2025",7972011265,"670223310","Gmina Grójec","ul. Józefa Piłsudskiego 47, 05-600 Grójec","1406053","grójecki","245","22.12.2025"]
["805.4.3.2025",8371692427,"611015661","Gmina Iłów","ul. Płocka 2, 96-520 Iłów","1428032","sochaczewski","444","22.12.2025"]
["805.4.50.2025",7991965356,"670223741","Gmina Jastrząb","Plac Niepodległości 5, 26-502 Jastrząb","1430023","szydłowiecki","460","22.12.2025"]
["805.4.19.2025",8222158817,"711582612","Gmina Kałuszyn","ul. Pocztowa 1, 05-310 Kałuszyn","1412093","miński","292"]
["805.4.22.2025",8221020459,"711582687","Gmina Kołbiel","ul. Szkolna 1, 05-340 Kołbiel","1417052","otwocki","341","22.12.2025"]
["805.4.45.2025",8212394019,"711582463","Gmina Kotuń","ul. Siedlecka 56C, 08-130 Kotuń","1426032","siedlecki","424","22.12.2025"]
["805.4.28.2025",9482371307,"670223818","Gmina Kowala","ul. Marii Walewskiej 7, 26-624 Kowala-Stępocina","1425072","radomski","414","22.12.2025"]
["805.4.24.2025",5311666399,"013270471","Gmina Leoncin","ul. Partyzantów 3, 05-155 Leoncin","1414032","nowodworski","310","22.12.2025"]
["805.4.49.2025",5110271300,"130378261","Gmina Lutocin","ul. Poniatowskiego 1, 09-317 Lutocin","1437042","żuromiński","507","22.12.2025"]
["805.4.5.2025",7742935675,"611015738","Gmina Łąck","ul. Gostynińska 2, 09-520 Łąck","1419072","płocki","358","22.12.2025"]
["805.4.23.2025",7743211086,"611015750","Gmina Mała Wieś","ul. Jana Kochanowskiego 1, 09-460 Mała Wieś","1419082","płocki","359","22.12.2025"]
["805.4.17.2025",7991958971,"670223847","Gmina Mirów","Mirów Stary 27, 26-503 Mirów Stary","1430032","szydłowiecki","461","22.12.2025"]
["805.4.57.2025",8371692019,"750148354","Gmina Młodzieszyn","ul. Wyszogrodzka 25, 96-512 Młodzieszyn","1428042","sochaczewski","445","22.12.2025"]
["805.4.12.2025",7761615078,"611015773","Gmina Mochowo","ul. Sierpecka 2, 09-214 Mochowo","1427032","sierpecki","437","22.12.2025"]
["805.4.46.2025",8222147185,"711582776","Gmina Mrozy","ul. Adama Mickiewicza 35, 05-320 Mrozy","1412123","miński","295","22.12.2025"]
["805.4.18.2025",5311607468,"130377899","Gmina Nasielsk","ul. Elektronowa 3, 05-190 Nasielsk","1414043","nowodworski","311","22.12.2025"]
["805.4.7.2025",7743211324,"611015796","Gmina Nowy Duninów","ul. Osiedlowa 1, 09-505 Nowy Duninów","1419092","płocki","360","22.12.2025"]
["805.4.54.2025",7591624953,"450670108","Gmina Nur","ul. Drohiczyńska 2, 07-322 Nur","1416062","ostrowski","331","22.12.2025"]
["805.4.16.2025",5671810266,"130378031","Gmina Płońsk","ul. Pułtuska 39, 09-100 Płońsk","1420011","płoński","375","22.12.2025"]
["805.4.47.2025",6010085828,"670223379","Gmina Przysucha","Plac Kolberga 11, 26-400 Przysucha","1423063","przysuski","397","22.12.2025"]
["805.4.13.2025",9482380424,"670223936","Gmina Przytyk","ul. Zachęta 57, 26-650 Przytyk","1425093","radomski","416","22.12.2025"]
["805.4.14.2025",7743128020,"611016057","Gmina Radzanowo","ul. Płocka 32, 09-451 Radzanowo","1419102","płocki","361","22.12.2025"]
["805.4.58.2025",7981435208,"670223942","Gmina Radzanów","Radzanów 92a, 26-807 Radzanów","1401032","białobrzeski","203","22.12.2025"]
["805.4.25.2025",7582141729,"550667959","Gmina Rzekuń","ul. Kościuszki 33, 07-411 Rzekuń","1415102","ostrołęcki","324"]
["805.4.56.2025",9710659463,"611015916","Gmina Sanniki","ul. Warszawska 169, 09-540 Sanniki","1404043","gostyniński","233","22.12.2025"]
["805.4.4.2025",7742945231,"611016028","Gmina Stara Biała","ul. Jana Kazimierza 1, 09-411 Biała","1419132","płocki","364"]
["805.4.38.2025",1231233414,"015891250","Gmina Tarczyn","ul. Juliana Stępkowskiego 17, 05-555 Tarczyn","1418063","piaseczyński","350","22.12.2025"]
["805.4.34.2025",5320000234,"013268994","Gmina Wiązowna","ul. Lubelska 59, 05-462 Wiązowna","1417082","otwocki","344","22.12.2025"]
["805.4.51.2025",7743211407,"611015508","Gmina Wyszogród","ul. Rębowska 37, 09-450 Wyszogród","1419153","płocki","366","22.12.2025"]
["805.4.53.2025",5671783457,"130378545","Gmina Załuski","ul. Gminna 17, 09-142 Załuski","1420122","płoński","378","22.12.2025"]
["805.4.44.2025",8111764762,"670223439","Gmina Zwoleń","ul. Plac Kochanowskiego 1, 26-700 Zwoleń","1436053","zwoleński","503","22.12.2025"]
["805.4.37.2025",8381888184,"540340545","Związek Powiatowo Gminny \"Żyrardowskie Przewozy Autobusowe\"","ul. Limanowskiego 45, 96-300 Żyardów","1438","żyrardowski","95216","22.12.2025"]
["805.4.29.2025",5291836443,"389450569","Związek Powiatowo-Gminny \"Grodziskie Przewozy Autobusowe\"","ul. Kościuszki 32a, 05-825 Grodzisk Mazowiecki","1405","grodziski","25938","22.12.2025"]
["805.4.40.2025",5291836443,"389450569","Związek Powiatowo-Gminny \"Grodziskie Przewozy Autobusowe\"","ul. Kościuszki 32a, 05-825 Grodzisk Mazowiecki","1405","grodziski","25938"]
["805.4.43.2025",5291836443,"389450569","Związek Powiatowo-Gminny \"Grodziskie Przewozy Autobusowe\"","ul. Kościuszki 32a, 05-825 Grodzisk Mazowiecki","1405","grodziski","25938"]
["805.3.9.2025",7971903240,"670223528","Gmina Błędów","ul. Sadurkowska 13, 05-620 Błędów","1406022","grójecki","242"]
["805.3.61.2025",7743188737,"611015678","Gmina Brudzeń Duży","ul. Toruńska 2, 09-414 Brudzeń Duży","1419032","płocki","354","22.12.2025"]
["805.3.17.2025",5090066518,"670223563","Gmina Chotcza","Chotcza-Józefów 60, 27-312 Chotcza-Józefów","1409012","lipski","263","22.12.2025"]
["805.3.60.2025",5661892908,"130378002","Gmina Ciechanów","ul. Fabryczna 8, 06-400 Ciechanów","1402011","ciechanowski","208","22.12.2025"]
["805.3.32.2025",7971904280,"670223669","Gmina Goszczyn","ul. Bądkowska 1B, 05-610 Goszczyn","1406042","grójecki","244","22.12.2025"]
["805.3.58.2025",7761615061,"611015951","Gmina Gozdowo","ul. Krystyna Gozdawy 19, 09-213 Gozdowo","1427022","sierpecki","436","22.12.2025"]
["805.3.22.2025",7962929257,"670223698","Gmina Gózd","ul. Radomska 7, 26-634 Gózd","1425022","radomski","409","22.12.2025"]
["805.3.1.2025",7962963277,"670223327","Gmina Iłża","ul. Rynek 11, 27-100 Iłża","1425033","radomski","410","22.12.2025"]
["805.3.28.2025",7971945741,"670223729","Gmina Jasieniec","ul. Warecka 42, 05-604 Jasieniec","1406062","grójecki","246"]
["805.3.37.2025",7962942660,"670223758","Gmina Jastrzębia","Jastrzębia 110, 26-631 Jastrzębia","1425042","radomski","411","22.12.2025"]
["805.3.13.2025",7962908568,"670223787","Gmina Jedlnia-Letnisko","ul. Radomska 43, 26-630 Jedlnia-Letnisko","1425063","radomski","413","22.12.2025"]
["805.3.24.2025",7571449122,"130378143","Gmina Karniewo","ul. Pułtuska 3, 06-425 Karniewo","1411032","makowski","277","22.12.2025"]
["805.3.41.2025",8121828216,"670223333","Gmina Kozienice","ul. Parkowa 5, 26-900 Kozienice","1407053","kozienicki","255","22.12.2025"]
["805.3.55.2025",8222148747,"711582730","Gmina Latowicz","ul. Rynek 6, 05-334 Latowicz","1412103","miński","293","22.12.2025"]
["805.3.31.2025",5090066174,"670223340","Gmina Lipsko","ul. 1 Maja 2, 27-300 Lipsko","1409033","lipski","265","22.12.2025"]
["805.3.45.2025",5342254841,"013269195","Gmina Nadarzyn","ul. Mszczonowska 24, 05-830 Nadarzyn","1421052","pruszkowski","383"]
["805.3.30.2025",5671786697,"130378284","Gmina Nowe Miasto","ul. Apteczna 8, 09-120 Nowe Miasto","1420083","płoński","374","22.12.2025"]
["805.3.7.2025",7971881633,"670223362","Gmina Nowe Miasto nad Pilicą","pl. Ojca Honorata Koźmińskiego 1/2, 26-420 Nowe Miasto nad Pilicą","1406083","grójecki","248"]
["805.3.3.2025",7972056581,"670223876","Gmina Pniewy","Pniewy 2, 05-652 Pniewy","1406092","grójecki","249","22.12.2025"]
["805.3.40.2025",5311688219,"013270531","Gmina Pomiechówek","ul. Szkolna 1A, 05-180 Pomiechówek","1414052","nowodworski","312","22.12.2025"]
["805.3.53.2025",1231050091,"013271170","Gmina Prażmów","ul. Piotra Czołchańskiego 1, 05-505 Prażmów","1418052","piaseczyński","349","22.12.2025"]
["805.3.62.2025",8111757928,"670223920","Gmina Przyłęk","Przyłęk, 26-704 Przyłęk","1436032","zwoleński","501"]
["805.3.52.2025",1251333745,"013269700","Gmina Radzymin","pl. Tadeusza Kościuszki 2, 05-250 Radzymin","1434093","wołomiński","489"]
["805.3.54.2025",5342488243,"013269232","Gmina Raszyn","ul. Szkolna 2A, 05-090 Raszyn","1421062","pruszkowski","384","22.12.2025"]
["805.3.44.2025",5361739574,"015570119","Gmina Serock","ul. Rynek 21, 05-140 Serock","1408043","legionowski","261","22.12.2025"]
["805.3.8.2025",8222147162,"711582782","Gmina Siennica","ul. Mińska 33, 05-332 Siennica","1412133","miński","296","22.12.2025"]
["805.3.35.2025",7962867409,"670223385","Gmina Skaryszew","ul. Juliusza Słowackiego 6, 26-640 Skaryszew","1425103","radomski","417","22.12.2025"]
["805.3.47.2025",8212393379,"711582575","Gmina Skórzec","ul. Siedlecka 3, 08-114 Skórzec","1426092","siedlecki","430","22.12.2025"]
["805.3.46.2025",7743210626,"611015968","Gmina Słubice","ul. Płocka 32, 09-533 Słubice","1419112","płocki","362","22.12.2025"]
["805.3.12.2025",5090066613,"670224002","Gmina Solec nad Wisłą","ul. Rynek 1, 27-320 Solec nad Wisłą","1409063","lipski","268","22.12.2025"]
["805.3.11.2025",8111714505,"670224031","Gmina Tczów","Tczów 124, 26-706 Tczów","1436042","zwoleński","502","22.12.2025"]
["805.3.26.2025",7582165888,"550667942","Gmina Troszyn","ul. Juliusza Słowackiego 13, 07-405 Troszyn","1415112","ostrołęcki","325"]
["805.3.36.2025",7972016015,"670223400","Gmina Warka","Plac Stefana Czarnieckiego 1, 05-660 Warka","1406113","grójecki","250","22.12.2025"]
["805.3.42.2025",7972016015,"670223400","Gmina Warka","Plac Stefana Czarnieckiego 1, 05-660 Warka","1406113","grójecki","250","22.12.2025"]
["805.3.59.2025",7591630959,"550667899","Gmina Wąsewo","ul. Zastawska 13, 07-311 Wąsewo","1416102","ostrowski","335","22.12.2025"]
["805.3.2.2025",5361758264,"013270577","Gmina Wieliszew","ul. Krzysztofa Kamila Baczyńskiego 1, 05-135 Wieliszew","1408052","legionowski","262","22.12.2025"]
["805.3.10.2025",9482391296,"670224060","Gmina Wolanów","ul. Radomska 20, 26-625 Wolanów","1425122","radomski","419","22.12.2025"]
["805.3.38.2025",7981457693,"670223422","Gmina Wyśmierzyce","ul. Adama Mickiewicza 75, 26-811 Wyśmierzyce","1401063","białobrzeski","206","22.12.2025"]
["805.3.29.2025",5311664696,"013270399","Gmina Zakroczym","ul. Warszawska 7, 05-170 Zakroczym","1414063","nowodworski","313"]
["805.3.64.2025",7981458304,"670223304","Miasto i Gmina Białobrzegi","Plac Zygmunta Starego 9, 26-800 Białobrzegi","1401013","białobrzeski","201","22.12.2025"]
["805.3.18.2025",7981464078,"670223132","Powiat Białobrzeski","Plac Zygmunta Starego 9, 26-800 Białobrzegi","1401000","białobrzeski","101"]
["805.3.76.2025",7981464078,"670223132","Powiat Białobrzeski","Plac Zygmunta Starego 9, 26-800 Białobrzegi","1401000","białobrzeski","101"]
["805.3.77.2025",7981464078,"670223132","Powiat Białobrzeski","Plac Zygmunta Starego 9, 26-800 Białobrzegi","1401000","białobrzeski","101"]
["805.3.78.2025",7981464078,"670223132","Powiat Białobrzeski","Plac Zygmunta Starego 9, 26-800 Białobrzegi","1401000","białobrzeski","101"]
["805.3.75.2025",5661889579,"130377706","Powiat Ciechanowski","ul. 17 Stycznia 7, 06-400 Ciechanów","1402000","ciechanowski","102"]
["805.3.23.2025",9710658050,"611016100","Powiat Gostyniński","ul. Romana Dmowskiego 13, 09-500 Gostynin","1404000","gostyniński","104"]
["805.3.15.2025",7972052212,"670223149","Powiat Grójecki","ul. Józefa Piłsudskiego 59, 05-600 Grójec","1406000","grójecki","106"]
["805.3.16.2025",7972052212,"670223149","Powiat Grójecki","ul. Józefa Piłsudskiego 59, 05-600 Grójec","1406000","grójecki","106"]
["805.3.19.2025",7972052212,"670223149","Powiat Grójecki","ul. Józefa Piłsudskiego 59, 05-600 Grójec","1406000","grójecki","106"]
["805.3.20.2025",7972052212,"670223149","Powiat Grójecki","ul. Józefa Piłsudskiego 59, 05-600 Grójec","1406000","grójecki","106"]
["805.3.21.2025",7972052212,"670223149","Powiat Grójecki","ul. Józefa Piłsudskiego 59, 05-600 Grójec","1406000","grójecki","106"]
["805.3.27.2025",7972052212,"670223149","Powiat Grójecki","ul. Józefa Piłsudskiego 59, 05-600 Grójec","1406000","grójecki","106"]
["805.3.65.2025",5361597016,"013269858","Powiat Legionowski","ul. gen. Władysława Sikorskiego 11, 05-119 Legionowo","1408000","legionowski","108"]
["805.3.66.2025",5090054952,"670223161","Powiat Lipski","ul. Rynek 1, 27-300 Lipsko","1409000","lipski","109"]
["805.3.67.2025",5090054952,"670223161","Powiat Lipski","ul. Rynek 1, 27-300 Lipsko","1409000","lipski","109"]
["805.4.27.2025",4960249456,"030237351","Powiat Łosicki","ul. Narutowicza 6, 08-200 Łosice","1410000","łosicki","110"]
["805.4.1.2025",7571452124,"550668841","Powiat Makowski","ul. Rynek 1, 06-200 Maków Mazowiecki","1411000","makowski","111"]
["805.4.2.2025",7571452124,"550668841","Powiat Makowski","ul. Rynek 1, 06-200 Maków Mazowiecki","1411000","makowski","111"]
["805.4.20.2025",5311688975,"013270034","Powiat Nowodworski","ul. Ignacego Paderewskiego 1B, 05-100 Nowy Dwór Mazowiecki","1414000","nowodworski","114"]
["805.3.4.2025",7582359776,"550668835","Powiat Ostrołęcki","Plac Generała Józefa Bema 5, 07-410 Ostrołęka","1415000","Ostrołęka","115"]
["805.3.6.2025",7582359776,"550668835","Powiat Ostrołęcki","Plac Generała Józefa Bema 5, 07-410 Ostrołęka","1415000","Ostrołęka","115"]
["805.3.68.2025",1231268996,"013270979","Powiat Piaseczyński","ul. Chyliczkowska 14, 05-500 Piaseczno","1418000","piaseczyński","119"]
["805.3.34.2025",7743227414,"611016034","Powiat Płocki","ul. Bielska 59, 09-400 Płock","1419000","Płock","120"]
["805.3.5.2025",7611527332,"550668812","Powiat Przasnyski","ul. św. Stanisława Kostki 5, 06-300 Przasnysz","1422000","przasnyski","124"]
["805.3.71.2025",6010078283,"670223190","Powiat Przysuski","ul. Aleja Jana Pawła II 10, 26-400 Przysucha","1423000","przysuski","125"]
["805.3.73.2025",5681618062,"130377729","Powiat Pułtuski","ul. Marii Skłodowskiej-Curie 11, 06-100 Pułtusk","1424000","pułtuski","126"]
["805.3.74.2025",5681618062,"130377729","Powiat Pułtuski","ul. Marii Skłodowskiej-Curie 11, 06-100 Pułtusk","1424000","pułtuski","126"]
["805.3.14.2025",7761676252,"611016169","Powiat Sierpecki","ul. Świętokrzyska 2A, 09-200 Sierpc","1427000","sierpecki","131"]
["805.4.15.2025",8231627536,"711581771","Powiat Sokołowski","ul. Wolności 23, 08-300 Sokołów Podlaski","1429000","sokołowski","133"]
["805.3.72.2025",7991963340,"670223215","Powiat Szydłowiecki","pl. Marii Konopnickiej 7, 26-500 Szydłowiec","1430000","szydłowiecki","134"]
["805.3.39.2025",8241765263,"711581831","Powiat Węgrowski","ul. Przemysłowa 5, 07-100 Węgrów","1433000","węgrowski","138"]
["805.3.69.2025",1250940609,"013269344","Powiat Wołomiński","ul. Prądzyńskiego 3, 05-200 Wołomin","1434000","wołomiński","138"]
["805.3.33.2025",7621886920,"550668829","Powiat Wyszkowski","Aleja Róż 2, 07-200 Wyszków","1435000","wyszkowski","139"]
["805.3.70.2025",8111766100,"670223221","Powiat Zwoleński","ul. Władysława Jagiełły 4, 26-700 Zwoleń","1436000","zwoleński","140"]
["805.3.56.2025",8222393748,"522184154","Powiatowo-gminny związek transportu publicznego Powiatu Mińskiego","ul. Budowlana 4; 05-300 Mińsk Mazowiecki","1412","miński","94476"]
["805.3.63.2025",8222393748,"522184154","Powiatowo-gminny związek transportu publicznego Powiatu Mińskiego","ul. Budowlana 4; 05-300 Mińsk Mazowiecki","1412","miński","94476"]
["805.4.11.2025",8262221226,"526980652","Związek Powiatowo - Gminny  \"Garwolińskie Przewozy Gminno - Powiatowe\"","ul. Mazowiecka 26, 08-400 Garwolin","1403","garwoliński","94475"]
["805.3.48.2025",5291836443,"389450569","Związek Powiatowo-Gminny \"Grodziskie Przewozy Autobusowe\"","ul. Kościuszki 32a, 05-825 Grodzisk Mazowiecki","1405","grodziski","25938"]
["805.3.49.2025",5291836443,"389450569","Związek Powiatowo-Gminny \"Grodziskie Przewozy Autobusowe\"","ul. Kościuszki 32a, 05-825 Grodzisk Mazowiecki","1405","grodziski","25938"]
["805.3.50.2025",5291836443,"389450569","Związek Powiatowo-Gminny \"Grodziskie Przewozy Autobusowe\"","ul. Kościuszki 32a, 05-825 Grodzisk Mazowiecki","1405","grodziski","25938"]
["805.4.39.2025",5291836443,"389450569","Związek Powiatowo-Gminny \"Grodziskie Przewozy Autobusowe\"","ul. Kościuszki 32a, 05-825 Grodzisk Mazowiecki","1405","grodziski","25938"]
["805.4.48.2025",5322102832,"524171813","Związek Powiatowo-Gminny \"Otwockie Przewozy Gminno-Powiatowe\"","ul. Komunardów 10, 05-402 Otwock","1417","otwocki","93665"]

{"sheet":"Miesiące","index":13,"n_rows":13,"n_cols":10,"rows_kept":13,"cut":false,"hidden":true,"merged":[[14,1,14,2],[14,3,14,4],[14,5,14,6]]}
[]
["I KWARTAŁ","STYCZEŃ",null,null,"WNIOSEK",null,null,"30.01.2026 r.",null,"30.04.2026 r."]
["II KWARTAŁ","LUTY",null,null,"KOREKTA WNIOSKU",null,null,"30.04.2026 r.",null,"30.07.2026 r."]
["III KWARTAŁ","MARZEC",null,null,null,null,null,"31.07.2026 r.",null,"30.10.2026 r."]
["IV KWARTAŁ","KWIECIEŃ",null,null,null,null,null,"30.10.2026 r.",null,"29.01.2027 r."]
[null,"MAJ"]
[null,"CZERWIEC"]
[null,"LIPIEC"]
[null,"SIERPIEŃ"]
[null,"WRZESIEŃ"]
[null,"PAŹDZIERNIK"]
[null,"LISTOPAD"]
[null,"GRUDZIEŃ"]