{"text_format":"1","workbook":"xlsx","n_sheets":3,"sheets":["Wstęp","Spichrz","Wydruk"],"not_rendered":{"charts":0,"images":0,"macros":1,"external_links":0,"defined_names":36,"comments":0,"pivot_tables":0},"unopened":[],"bounds":{"document_bytes":16777216,"sheet_cells":100000,"rows_first":2000,"rows_last":500,"rows_between":2000,"halvings":0,"cell_chars":16384,"cell_head_chars":4096},"cells_cut":0,"cells_raw":0,"read":"whole","date_system":"1900"}

{"sheet":"Wstęp","index":0,"n_rows":16,"n_cols":3,"rows_kept":16,"cut":false,"hidden":false,"merged":[]}
[]
[]
[null,null,"Wybierz projekt POWER:"]
[null,null,""]
[]
[null,null,"Obecny status udziału w projekcie"]
[]
[]
[null,null,"Status osoby na rynku pracy w chwili przystąpienia do projektu "]
[null,null,"osoba pracująca "]
[]
[]
[]
[]
[null,null,"Liczba nieuzupełnionych jeszcze komórek:"]
[null,null,44]

{"sheet":"Spichrz","index":1,"n_rows":66,"n_cols":11,"rows_kept":66,"cut":false,"hidden":true,"merged":[]}
[]
[null,"Liderzy w zarządzaniu uczelnią","POWR.03.04.00-00-P007/16","wspr1","po rozpoczęciu projektu",null,"osoba bezrobotna niezarejestrowana w ewidencji UP"]
[null,"Najlepsi z najlepszych! 3.0","POWR.03.03.00-00-P011/18","wspr2","po zakończeniu projektu",null,"osoba bezrobotna zarejestrowana w ewidencji UP"]
[null,"Najlepsi z najlepszych! 4.0","POWR.03.03.00-00-P019/18","wspr2",null,null,"osoba bierna zawodowo"]
[null,"Program praktyk zawodowych w Państwowych Wyższych Szkołach Zawodowych","POWR.03.01.00-00-P002/15","wspr3",null,null,"osoba pracująca ",null,"nie dotyczy",null,"pracownik lub przedstawiciel instytucji/podmiotu"]
[null,"Mistrzowie dydaktyki","POWR.04.03.00-00-0074/17","wspr4",null,null,null,null,null,null,"indywidualny"]
[null,"Mistrzowie dydaktyki – Wdrożenie modelu tutoringu","POWR.04.03.00-00-0074/17","wspr4"]
[null,"Szkoła Orłów","POWR.03.01.00-00-P015/18","wspr5","tak",null,"doskonalenie zawodowe kadr zatrudnionych w instytucji"]
[null,"Wspieranie procesów restrukturyzacji zatrudnienia w ramach konsolidacji uczelni","POWR.03.06.00-00-P010/18","wspr6","nie",null,"inne",null,null,null,"inny"]
[null,"Doskonałość dydaktyczna uczelni","POWR.03.04.00-00-P023/21","wspr1a",null,null,null,null,null,null,"instruktor praktycznej nauki zawodu"]
[null,null,null,null,null,null,null,null,null,null,"kluczowy pracownik instytucji pomocy i integracji społecznej"]
[null,null,null,null,null,null,null,null,null,null,"nauczyciel kształcenia ogólnego"]
[null,null,null,null,"kobieta",null,"policealne",null,null,null,"nauczyciel kształcenia zawodowego"]
[null,"kadra kierownicza","nauczyciel akademicki",null,"mężczyzna",null,"ponadgimnazjalne",null,null,null,"nauczyciel wychowania przedszkolnego"]
[null,"kadra administracyjna","student",null,null,null,"wyższe",null,null,null,"pracownik instytucji rynku pracy"]
[null,null,null,null,null,null,null,null,null,null,"pracownik instytucji systemu ochrony zdrowia"]
[null,"inne","pracownik aktualnie zatrudniony na uczelni",null,"inne",null,"inne",null,null,null,"pracownik instytucji systemu wspierania rodziny i pieczy zastępczej"]
[null,"osoba długotrwale bezrobotna ","były pracownik uczelni",null,"osoba ucząca się ",null,"prowadząca działalność na własny rachunek",null,null,null,"pracownik instytucji szkolnictwa wyższego"]
[null,null,null,null,"osoba nieuczestnicząca w kształceniu lub szkoleniu",null,"w administracji rządowej",null,null,null,"pracownik ośrodka wspierania ekonomii społecznej"]
[null,"inne",null,null,null,null,"w administracji samorządowej",null,null,null,"pracownik poradni psychologiczno – pedagogicznej"]
[null,"osoba kontynuuje zatrudnienie",null,null,null,null,"w dużym przedsiębiorstwie",null,null,null,"rolnik"]
[null,"osoba nabyła kompetencje",null,null,null,null,"w MMŚP"]
[null,"osoba nie podjeła żadnej nowej aktywności po zakończeniu udziału w projekcie",null,null,null,null,"w organizacji pozarządowej"]
[null,"osoba podjeła kształcenie lub szkolenie"]
[null,"osoba podjęła pracę / rozpoczęła prowadzenie działalności na własny rachunek",null,null,null,null,null,null,null,null,"osoba nie otrzymała żadnej oferty"]
[null,"osoba poszukująca pracy",null,null,null,null,null,null,null,null,"osoba otrzymała ofertę przygotowania zawodowego"]
[null,"osoba poszukująca pracy po przerwie związanej z urodzeniem/wychowywaniem dziecka",null,null,null,null,null,null,null,null,"osoba otrzymała ofertę stażu"]
[null,"osoba pracująca / prowadząca działalność na własny rachunek po przerwie związanej z urodzeniem/wychowywaniem dziecka",null,null,null,null,null,null,null,null,"osoba otrzymała ofertę pracy"]
[null,"osoba uzyskała kwalifikacje",null,null,null,null,null,null,null,null,"osoba otrzymała ofertę ustawicznego kształcenia"]
[null,"sytuacja w trakcie monitorowania",null,null,null,null,null,null,null,null,"projekt nie dotyczy inicjatywy na rzecz zatrudniania ludzi młodych"]
[null,"nie dotyczy",null,null,null,null,null,null,null,null,"sytuacja w trakcie monitorowania"]
[]
[null,"doskonalenie zawodowe","inne","szkolenie/kurs","wizyta studyjna","stypendium","dodatek relokacyjny",null,null,null,"tak"]
[null,"inne","szkolenie/kurs","wyposażenie lub doposażenie stanowiska pracy","inne","inne","doradztwo",null,null,null,"nie"]
[null,"szkolenie/kurs","zajęcia dodatkowe","zwrot kosztów przejazdu, zakwaterowania",null,null,"doskonalenie zawodowe",null,null,null,"odmowa podania informacji"]
[null,"wizyta studyjna","zwrot kosztów przejazdu, zakwaterowania",null,null,null,"inne"]
[null,null,null,null,null,null,"opieka nad dzieckiem do lat 3 / refundacja opieki nad dziećmi do lat 7 lub inna osobą zależną"]
[null,"dolnośląskie",null,null,null,null,"pośrednictwo pracy"]
[null,"kujawsko-pomorskie",null,null,null,null,"program outplacementowy"]
[null,"lubelskie",null,null,null,null,"przygotowanie zawodowe dorosłych"]
[null,"lubuskie",null,null,null,null,"staż/praktyka"]
[null,"łódzkie",null,null,null,null,"studia / kształcenie podyplomowe"]
[null,"małopolskie",null,null,null,null,"stypendium"]
[null,"mazowieckie",null,null,null,null,"szkolenie/kurs"]
[null,"opolskie"]
[null,"podkarpackie"]
[null,"podlaskie"]
[null,"pomorskie"]
[null,"śląskie"]
[null,"świętokrzyskie"]
[null,"warmińsko-mazurskie"]
[null,"wielkopolskie"]
[null,"zachodniopomorskie"]
[]
[null,"doradztwo edukacyjno-zawodowe","dodatek relokacyjny","dla doktoranta"]
[null,"doradztwo prawne / pomoc prawna","doradztwo zawodowe","dla osoby bezrobotnej"]
[null,"doradztwo psychologiczne","dotacja na rozpoczęcie własnej działalności gospodarczej","dla studenta"]
[null,"doradztwo/poradnictwo zawodowe","inne","dla ucznia innej placówki prowadzącej kształcenie zawodowe"]
[null,"inne","pośrednictwo pracy","dla ucznia szkoły ogólnokształcacej"]
[null,null,"staż/praktyka","dla ucznia szkoły branżowej I stopnia"]
[null,null,"poradnictwo psychologiczne","dla ucznia szkoły branżowej II stopnia"]
[null,null,"studia / kształcenie podyplomowe","dla ucznia szkoły policealnej"]
[null,null,"subsydiowanie zatrudnienia","dla ucznia szkół specjalnych przysposabiających do pracy"]
[null,null,"szkolenie/kurs","dla ucznia technikum"]
[null,null,null,"dla ucznia zasadniczej szkoły zawodowej"]
[null,null,null,"inne"]

{"sheet":"Wydruk","index":2,"n_rows":259,"n_cols":9,"rows_kept":259,"cut":false,"hidden":false,"merged":[[256,2,257,2],[258,2,260,2]]}
[null,null,null,null,null,"warunek w definicji"]
[null,null,null,null,null,null,"walidacja"]
[null,null,"Informacje o projekcie",null,null,null,null,"odniesienia w walidacji"]
[null,null,null,null,null,null,null,null,"dropdown"]
[null,null,"Numer umowy/decyzji/aneksu "]
[null,null,{"$f":"IF(Wstęp!$C$4=\"\",\"\",VLOOKUP(Wstęp!$C$4,POWRy,2,FALSE))","v":""},null,null,"✔"]
[]
[null,null,"Numer umowy z MEiN"]
[null,null,"nie dotyczy"]
[null,null,null,null,null,null,"✔"]
[]
[null,null,"Nazwa beneficjenta "]
[null,null,"Ministerstwo Edukacji i Nauki"]
[]
[null,null,"Nazwa uczelni"]
[null,null,null,null,null,null,"✔"]
[]
[null,null,"Kierunek"]
[null,null,"nie dotyczy"]
[null,null,null,null,null,null,"✔"]
[]
[null,null,"Tytuł projektu POWER"]
[null,null,{"$f":"Wstęp!C4","v":""}]
[]
[null,null,"Nazwa projektu"]
[null,null,"nie dotyczy"]
[null,null,null,null,null,null,"✔"]
[]
[]
[null,null,"Dane instytucji otrzymujących wsparcie – dane podstawowe "]
[]
[null,null,"Kraj"]
[null,null,"Polska"]
[]
[null,null,"Nazwa instytucji "]
[null,null,null,null,null,null,"jak 113"]
[]
[null,null,"Brak NIP "]
[null,null,null,null,null,null,null,null,"✔"]
[]
[null,null,"NIP (zapisany ciągiem, bez łączników)"]
[null,null,"nie dotyczy"]
[null,null,null,null,null,null,"✔"]
[]
[null,null,"Typ instytucji"]
[null,null,"uczelnia / jednostka organizacyjna uczelni"]
[]
[null,null,"Województwo"]
[null,null,null,null,null,null,null,null,"jak 142"]
[]
[null,null,"Powiat "]
[null,null,null,null,null,null,"jak 145"]
[]
[null,null,"Gmina "]
[null,null,null,null,null,null,"jak 148"]
[]
[null,null,"Miejscowość "]
[null,null,null,null,null,null,"jak 151"]
[]
[null,null,"Ulica"]
[null,null,null,null,null,null,"jak 154"]
[]
[null,null,"Nr budynku "]
[null,null,null,null,null,null,"jak 157"]
[]
[null,null,"Nr lokalu "]
[null,null,null,null,null,null,"jak 160"]
[]
[null,null,"Kod pocztowy "]
[null,null,null,null,null,null,"jak 163"]
[]
[null,null,"Telefon kontaktowy "]
[null,null,null,null,null,null,"jak 166"]
[]
[null,null,"Adres e-mail "]
[null,null,null,null,null,null,"jak 169"]
[]
[null,null,"Data rozpoczęcia udziału w projekcie "]
[null,null,null,null,null,null,null,"w parze z 82"]
[]
[null,null,"Data zakończenia udziału w projekcie "]
[null,null,null,null,null,null,null,"w parze z 79"]
[]
[null,null,"Czy wsparciem zostali objęci pracownicy instytucji? "]
[null,null,{"$f":"IF(OR(Wstęp!C4=Spichrz!B2,Wstęp!C4=Spichrz!B8,Wstęp!C4=Spichrz!B9,Wstęp!C4=Spichrz!B10),\"tak\",\"nie\")","v":"nie"},null,null,"✔"]
[]
[null,null,"Rodzaj przyznanego wsparcia"]
[null,null,"nie dotyczy"]
[null,null,null,null,null,null,null,"✔","multi"]
[]
[null,null,"W tym"]
[]
[]
[null,null,"Data rozpoczęcia udziału we wsparciu "]
[null,null,"nie dotyczy"]
[null,null,null,null,null,null,null,"w parze z 100"]
[]
[null,null,"Data zakończenia udziału we wsparciu "]
[null,null,"nie dotyczy"]
[null,null,null,null,null,null,null,"w parze z 96"]
[]
[]
[]
[null,null,"Dane uczestników projektów otrzymujących wsparcie – indywidualni i pracownicy instytucji – dane uczestnika"]
[]
[null,null,"Kraj"]
[null,null,"Polska"]
[]
[null,null,"Rodzaj uczestnika"]
[null,null,{"$f":"IF(OR(Wstęp!C4=Spichrz!B2,Wstęp!C4=Spichrz!B8,Wstęp!C4=Spichrz!B10),Spichrz!K5,Spichrz!K6)","v":"indywidualny"},null,null,"✔"]
[]
[null,null,"Nazwa instytucji "]
[null,null,null,null,null,null,"jak 36"]
[]
[null,null,"Rodzaj uczestnika"]
[null,null,"nie dotyczy"]
[null,null,null,null,null,null,null,"✔","✔"]
[]
[null,null,"Imię "]
[null,null,null,null,null,null,"✔"]
[]
[null,null,"Nazwisko"]
[null,null,null,null,null,null,"✔"]
[]
[null,null,"Brak PESEL "]
[null,null,null,null,null,null,null,null,"✔"]
[]
[null,null,"PESEL"]
[null,null,"nie dotyczy"]
[null,null,null,null,null,null,"✔"]
[]
[null,null,"Płeć "]
[null,null,null,null,null,null,null,null,"✔"]
[]
[null,null,"Wiek w chwili przystąpienia do projektu"]
[null,null,null,null,null,null,"✔"]
[]
[null,null,"Wykształcenie"]
[null,null,null,null,null,null,null,null,"✔"]
[]
[null,null,"Województwo"]
[null,null,null,null,null,null,null,null,"jak 49"]
[]
[null,null,"Powiat "]
[null,null,null,null,null,null,"jak 52"]
[]
[null,null,"Gmina "]
[null,null,null,null,null,null,"jak 55"]
[]
[null,null,"Miejscowość "]
[null,null,null,null,null,null,"jak 58"]
[]
[null,null,"Ulica"]
[null,null,null,null,null,null,"jak 61"]
[]
[null,null,"Nr budynku "]
[null,null,null,null,null,null,"jak 64"]
[]
[null,null,"Nr lokalu "]
[null,null,null,null,null,null,"jak 67"]
[]
[null,null,"Kod pocztowy "]
[null,null,null,null,null,null,"jak 70"]
[]
[null,null,"Telefon kontaktowy "]
[null,null,null,null,null,null,"jak 73"]
[]
[null,null,"Adres e-mail "]
[null,null,null,null,null,null,"jak 76"]
[]
[]
[null,null,"Szczegóły i rodzaj wsparcia"]
[]
[null,null,"Data rozpoczęcia udziału w projekcie"]
[null,null,null,null,null,null,null,"w parze z 179"]
[]
[null,null,"Data zakończenia udziału w projekcie "]
[null,null,"nie dotyczy"]
[null,null,null,null,null,null,null,"w parze z 175"]
[]
[null,null,"Status osoby na rynku pracy w chwili przystąpienia do projektu"]
[null,null,{"$f":"IF(OR(Wstęp!C4=Spichrz!B2,Wstęp!C4=Spichrz!B6,Wstęp!C4=Spichrz!B10),Spichrz!G5,Wstęp!C11)","v":0},null,null,"✔"]
[]
[null,null,"W tym"]
[null,null,null,null,null,null,null,"✔","✔"]
[]
[null,null,"Wykonywany zawód"]
[null,null,"nie dotyczy"]
[null,null,null,null,null,null,null,null,"✔"]
[]
[null,null,"Zatrudniony w "]
[null,null,"nie dotyczy"]
[null,null,null,null,null,null,"✔"]
[]
[null,null,"Sytuacja (1) osoby w momencie zakończenia udziału w projekcie"]
[null,null,"nie dotyczy"]
[null,null,null,null,null,null,null,null,"w parze z 201"]
[]
[null,null,"Sytuacja (2) osoby w momencie zakończenia udziału w projekcie"]
[null,null,"nie dotyczy"]
[null,null,null,null,null,null,null,null,"w parze z 197"]
[]
[null,null,"Inne rezultaty dotyczące osób młodych (dotyczy IZM)"]
[null,null,"nie dotyczy"]
[null,null,null,null,null,null,null,null,"multi"]
[]
[null,null,"Zakończenie udziału osoby w projekcie zgodnie z zaplanowaną dla niej ścieżką uczestnictwa"]
[null,null,"nie dotyczy"]
[null,null,null,null,null,null,null,null,"✔"]
[]
[null,null,"Rodzaj przyznanego wsparcia"]
[null,null,"nie dotyczy"]
[null,null,"staż/praktyka\nstypendium"]
[null,null,null,null,null,null,null,"✔","multi"]
[]
[null,null,"W tym"]
[null,null,"nie dotyczy"]
[null,null,"dla studentów"]
[null,null,"(dla pozycji doradztwo)"]
[null,null,null,null,null,null,null,"✔"]
[null,null,"(dla pozycji program outplacementowy)"]
[null,null,null,null,null,null,null,"✔"]
[null,null,"(dla pozycji staż/praktyka)"]
[null,null,null,null,null,null,null,"✔"]
[]
[null,null,"Data rozpoczęcia udziału we wsparciu "]
[null,null,"nie dotyczy"]
[null,null,null,null,null,null,null,"w parze z 227"]
[]
[null,null,"Data zakończenia udziału we wsparciu"]
[null,null,"nie dotyczy"]
[null,null,null,null,null,null,null,"w parze z 223"]
[]
[]
[null,null,"Status uczestnika projektu w chwili przystąpienia do projektu  "]
[]
[null,null,"Osoba należąca do mniejszości narodowej lub etnicznej, migrant, osoba obcego pochodzenia "]
[null,null,null,null,null,null,null,null,"✔"]
[]
[null,null,"Osoba bezdomna lub dotknięta wykluczeniem z dostępu do mieszkań "]
[null,null,null,null,null,null,null,null,"✔"]
[]
[null,null,"Osoba z niepełnosprawnościami "]
[null,null,null,null,null,null,null,null,"✔"]
[]
[null,null,"Osoba w innej niekorzystnej sytuacji społecznej"]
[null,null,null,null,null,null,null,null,"✔"]
[]
[]
[]
[null,null,{"$f":"IF(Wstęp!C16=0,TODAY(),\"Nie wypełniono wszystkich wymaganych pól!\")","v":"Nie wypełniono wszystkich wymaganych pól!"},null,null,"✔"]
[]
[null,null,"…………………………………………………………"]
[null,null,"CZYTELNY PODPIS UCZESTNIKA PROJEKTU"]
[]
[]
[null,null,"UWAGA"]
[]
[null,null,"Proszę pamiętać o własnoręcznym podpisaniu wypełnionego formularza po wydrukowaniu"]