{"text_format":"1","workbook":"xlsx","n_sheets":8,"sheets":["Priorytety szkoleniowe","Liczba dni szkoleń","Ceny szkoleń","Planowanie szkoleń","Koszty szkoleń","Ceny szkoleń - wykonanie","Wykonanie szkoleń ad hoc","Wykonanie planu"],"not_rendered":{"charts":0,"images":0,"macros":1,"external_links":0,"defined_names":10,"comments":7,"pivot_tables":0},"unopened":[],"bounds":{"document_bytes":16777216,"sheet_cells":100000,"rows_first":2000,"rows_last":500,"rows_between":2000,"halvings":0,"cell_chars":16384,"cell_head_chars":4096},"cells_cut":0,"cells_raw":0,"read":"whole","date_system":"1900"}

{"sheet":"Priorytety szkoleniowe","index":0,"n_rows":17,"n_cols":15,"rows_kept":17,"cut":false,"hidden":false,"merged":[[10,3,10,5],[10,6,10,8],[10,9,10,11],[0,0,0,14],[9,0,9,14],[10,12,10,14],[1,12,1,14],[1,3,1,5],[1,6,1,8],[1,9,1,11]]}
["Szkolenia planowane"]
[null,null,null,"Jednostka organizacyjna",null,null,"Grupa tematyczna: Prawo",null,null,"Grupa tematyczna: Finanse",null,null,"Grupa tematyczna 3"]
["Lp.","Pracownik","Członek korpusu służby cywilnej tak/nie","Dział","Wydział","Departament","Prawo administracyjne","Prawo finansów publicznych","Prawo zamówień publicznych","Audyt","Controling","Ekonomia","Tematyka 1","Tamatyka 2","Tematyka 3"]
[1,"Jan Kowalski",true,null,null,null,3,null,null,1,3,null,2]
[2,"Maria Nowak",true,null,null,null,null,2,1,3,null,2,3,2]
[3,"Piotr Krasinski",true,null,null,null,3,null,2,3,null,null,2,null,2]
[4,null,false]
[5,null,false]
[]
["Szkolenia ad hoc"]
{"$rows_left_out":8}
{"sheet":"Liczba dni szkoleń","index":1,"n_rows":17,"n_cols":14,"rows_kept":17,"cut":false,"hidden":false,"merged":[[10,2,10,4],[10,5,10,7],[10,8,10,10],[10,11,10,13],[0,0,0,13],[9,0,9,13],[1,8,1,10],[1,11,1,13],[1,2,1,4],[1,5,1,7]]}
["Szkolenia planowane"]
[null,null,"Jednostka organizacyjna",null,null,"Grupa tematyczna: Prawo",null,null,"Grupa tematyczna: Finanse",null,null,"Grupa tematyczna 3"]
["Lp.","Pracownik","Dział","Wydział","Departament","Prawo administracyjne","Prawo finansów publicznych","Prawo zamówień publicznych","Audyt","Controling","Ekonomia","Tematyka 1","Tematyka 2","Tematyka 3"]
[1,"Jan Kowalski",null,null,null,2,4,5,3,1,5,6,3,10]
[2,"Maria Nowak",null,null,null,2,4,5,3,1,5,6,3,10]
[3,"Piotr Krasinski",null,null,null,2,4,5,3,1,5,6,3,10]
[4]
[5]
[]
["Szkolenia ad hoc"]
{"$rows_left_out":8}
{"sheet":"Ceny szkoleń","index":2,"n_rows":17,"n_cols":14,"rows_kept":17,"cut":false,"hidden":false,"merged":[[16,2,16,4],[10,11,10,13],[15,2,15,4],[2,2,2,4],[7,2,7,4],[4,2,4,4],[1,11,1,13],[10,0,10,1],[10,2,11,4],[5,2,5,4],[6,2,6,4],[0,0,0,10],[9,0,9,10],[12,2,12,4],[13,2,13,4],[14,2,14,4],[10,5,10,7],[10,8,10,10],[3,2,3,4],[1,2,1,4],[1,5,1,7],[1,8,1,10]]}
["Szkolenia planowane"]
[null,null,null,null,null,"Grupa tematyczna: Prawo",null,null,"Grupa tematyczna: Finanse",null,null,"Grupa tematyczna 3"]
["Lp.","Podtyp szkolenia","Sposób wyliczenia ceny",null,null,"Prawo administracyjne","Prawo finansów publicznych","Prawo zamówień publicznych","Audyt","Controling","Ekonomia","Tematyka 1","Tamatyka 2","Tematyka 3"]
[1,"otwarte","cena za osobodzień",null,null,1000,1000,1000,200,500,200,1000,800,800]
[2,"zewnętrzne zamknięte","cena za osobodzień",null,null,500,500,500,80,300,80,600,500,500]
[3,"wewnętrzne zamknięte","cena za osobodzień",null,null,250,250,200,20,200,20,50,50,50]
[]
[null,"Udział pracowników w finansowaniu","%",null,null,0,0,0,0.3,0,0,0,0,0]
[]
["Szkolenia ad hoc"]
{"$rows_left_out":8}
{"sheet":"Planowanie szkoleń","index":3,"n_rows":28,"n_cols":22,"rows_kept":28,"cut":false,"hidden":false,"merged":[[0,9,0,11],[0,12,0,14],[1,17,1,19],[20,0,20,5],[19,17,19,19],[2,0,2,15],[9,0,9,15],[8,0,8,5],[0,3,0,5],[0,6,0,8],[17,0,17,5],[2,17,2,19],[21,0,21,5],[22,4,22,5],[23,4,23,5],[22,0,23,3],[26,0,27,3],[26,4,26,5],[27,4,27,5],[24,4,24,5],[25,4,25,5],[24,0,25,3]]}
[null,null,null,"Jednostka organizacyjna",null,null,"Grupa tematyczna: Prawo",null,null,"Grupa tematyczna: Finanse",null,null,"Grupa tematyczna 3"]
["Lp.","Pracownik","Członek korpusu służby cywilnej tak/nie","Dział","Wydział","Departament","Prawo administracyjne","Prawo finansów publicznych","Prawo zamówień publicznych","Audyt","Controling","Ekonomia","Tematyka 1","Tamatyka 2","Tematyka 3","Suma ",null,"Policz szkolenia z priorytetem",null,null,null,1]
["Liczba osób na szkoleniach",null,null,null,null,null,null,null,null,null,null,null,null,null,null,null,null,1,null,null,null,2]
[1,"Jan Kowalski",{"$f":"'Priorytety szkoleniowe'!C13","v":"tak"},null,null,null,{"$f":"IF('Priorytety szkoleniowe'!G4=0,0,IF($R$3<='Priorytety szkoleniowe'!G4,1,0))","v":1},{"$f":"IF('Priorytety szkoleniowe'!H4=0,0,IF($R$3<='Priorytety szkoleniowe'!H4,1,0))","v":0},{"$f":"IF('Priorytety szkoleniowe'!I4=0,0,IF($R$3<='Priorytety szkoleniowe'!I4,1,0))","v":0},{"$f":"IF('Priorytety szkoleniowe'!J4=0,0,IF($R$3<='Priorytety szkoleniowe'!J4,1,0))","v":1},{"$f":"IF('Priorytety szkoleniowe'!K4=0,0,IF($R$3<='Priorytety szkoleniowe'!K4,1,0))","v":1},{"$f":"IF('Priorytety szkoleniowe'!L4=0,0,IF($R$3<='Priorytety szkoleniowe'!L4,1,0))","v":0},{"$f":"IF('Priorytety szkoleniowe'!M4=0,0,IF($R$3<='Priorytety szkoleniowe'!M4,1,0))","v":1},{"$f":"IF('Priorytety szkoleniowe'!N4=0,0,IF($R$3<='Priorytety szkoleniowe'!N4,1,0))","v":0},{"$f":"IF('Priorytety szkoleniowe'!O4=0,0,IF($R$3<='Priorytety szkoleniowe'!O4,1,0))","v":0},{"$f":"SUM(G4:O4)","v":4},null,null,null,null,null,3]
[2,"Maria Nowak",{"$f":"'Priorytety szkoleniowe'!C14","v":"tak"},null,null,null,{"$f":"IF('Priorytety szkoleniowe'!G5=0,0,IF($R$3<='Priorytety szkoleniowe'!G5,1,0))","v":0},{"$f":"IF('Priorytety szkoleniowe'!H5=0,0,IF($R$3<='Priorytety szkoleniowe'!H5,1,0))","v":1},{"$f":"IF('Priorytety szkoleniowe'!I5=0,0,IF($R$3<='Priorytety szkoleniowe'!I5,1,0))","v":1},{"$f":"IF('Priorytety szkoleniowe'!J5=0,0,IF($R$3<='Priorytety szkoleniowe'!J5,1,0))","v":1},{"$f":"IF('Priorytety szkoleniowe'!K5=0,0,IF($R$3<='Priorytety szkoleniowe'!K5,1,0))","v":0},{"$f":"IF('Priorytety szkoleniowe'!L5=0,0,IF($R$3<='Priorytety szkoleniowe'!L5,1,0))","v":1},{"$f":"IF('Priorytety szkoleniowe'!M5=0,0,IF($R$3<='Priorytety szkoleniowe'!M5,1,0))","v":1},{"$f":"IF('Priorytety szkoleniowe'!N5=0,0,IF($R$3<='Priorytety szkoleniowe'!N5,1,0))","v":1},{"$f":"IF('Priorytety szkoleniowe'!O5=0,0,IF($R$3<='Priorytety szkoleniowe'!O5,1,0))","v":0},{"$f":"SUM(G5:O5)","v":6}]
[3,"Piotr Krasinski",{"$f":"'Priorytety szkoleniowe'!C15","v":"tak"},null,null,null,{"$f":"IF('Priorytety szkoleniowe'!G6=0,0,IF($R$3<='Priorytety szkoleniowe'!G6,1,0))","v":1},{"$f":"IF('Priorytety szkoleniowe'!H6=0,0,IF($R$3<='Priorytety szkoleniowe'!H6,1,0))","v":0},{"$f":"IF('Priorytety szkoleniowe'!I6=0,0,IF($R$3<='Priorytety szkoleniowe'!I6,1,0))","v":1},{"$f":"IF('Priorytety szkoleniowe'!J6=0,0,IF($R$3<='Priorytety szkoleniowe'!J6,1,0))","v":1},{"$f":"IF('Priorytety szkoleniowe'!K6=0,0,IF($R$3<='Priorytety szkoleniowe'!K6,1,0))","v":0},{"$f":"IF('Priorytety szkoleniowe'!L6=0,0,IF($R$3<='Priorytety szkoleniowe'!L6,1,0))","v":0},{"$f":"IF('Priorytety szkoleniowe'!M6=0,0,IF($R$3<='Priorytety szkoleniowe'!M6,1,0))","v":1},{"$f":"IF('Priorytety szkoleniowe'!N6=0,0,IF($R$3<='Priorytety szkoleniowe'!N6,1,0))","v":0},{"$f":"IF('Priorytety szkoleniowe'!O6=0,0,IF($R$3<='Priorytety szkoleniowe'!O6,1,0))","v":1},{"$f":"SUM(G6:O6)","v":5}]
[4,null,{"$f":"'Priorytety szkoleniowe'!C16","v":"nie"},null,null,null,{"$f":"IF('Priorytety szkoleniowe'!G7=0,0,IF($R$3<='Priorytety szkoleniowe'!G7,1,0))","v":0},{"$f":"IF('Priorytety szkoleniowe'!H7=0,0,IF($R$3<='Priorytety szkoleniowe'!H7,1,0))","v":0},{"$f":"IF('Priorytety szkoleniowe'!I7=0,0,IF($R$3<='Priorytety szkoleniowe'!I7,1,0))","v":0},{"$f":"IF('Priorytety szkoleniowe'!J7=0,0,IF($R$3<='Priorytety szkoleniowe'!J7,1,0))","v":0},{"$f":"IF('Priorytety szkoleniowe'!K7=0,0,IF($R$3<='Priorytety szkoleniowe'!K7,1,0))","v":0},{"$f":"IF('Priorytety szkoleniowe'!L7=0,0,IF($R$3<='Priorytety szkoleniowe'!L7,1,0))","v":0},{"$f":"IF('Priorytety szkoleniowe'!M7=0,0,IF($R$3<='Priorytety szkoleniowe'!M7,1,0))","v":0},{"$f":"IF('Priorytety szkoleniowe'!N7=0,0,IF($R$3<='Priorytety szkoleniowe'!N7,1,0))","v":0},{"$f":"IF('Priorytety szkoleniowe'!O7=0,0,IF($R$3<='Priorytety szkoleniowe'!O7,1,0))","v":0},{"$f":"SUM(G7:O7)","v":0}]
[5,null,{"$f":"'Priorytety szkoleniowe'!C17","v":"nie"},null,null,null,{"$f":"IF('Priorytety szkoleniowe'!G8=0,0,IF($R$3<='Priorytety szkoleniowe'!G8,1,0))","v":0},{"$f":"IF('Priorytety szkoleniowe'!H8=0,0,IF($R$3<='Priorytety szkoleniowe'!H8,1,0))","v":0},{"$f":"IF('Priorytety szkoleniowe'!I8=0,0,IF($R$3<='Priorytety szkoleniowe'!I8,1,0))","v":0},{"$f":"IF('Priorytety szkoleniowe'!J8=0,0,IF($R$3<='Priorytety szkoleniowe'!J8,1,0))","v":0},{"$f":"IF('Priorytety szkoleniowe'!K8=0,0,IF($R$3<='Priorytety szkoleniowe'!K8,1,0))","v":0},{"$f":"IF('Priorytety szkoleniowe'!L8=0,0,IF($R$3<='Priorytety szkoleniowe'!L8,1,0))","v":0},{"$f":"IF('Priorytety szkoleniowe'!M8=0,0,IF($R$3<='Priorytety szkoleniowe'!M8,1,0))","v":0},{"$f":"IF('Priorytety szkoleniowe'!N8=0,0,IF($R$3<='Priorytety szkoleniowe'!N8,1,0))","v":0},{"$f":"IF('Priorytety szkoleniowe'!O8=0,0,IF($R$3<='Priorytety szkoleniowe'!O8,1,0))","v":0},{"$f":"SUM(G8:O8)","v":0}]
["Suma osób",null,null,null,null,null,{"$f":"SUM(G4:G8)","v":2},1,2,3,1,1,3,1,1]
["Liczba osobodni szkoleniowych"]
{"$rows_left_out":19}
{"sheet":"Koszty szkoleń","index":4,"n_rows":46,"n_cols":16,"rows_kept":46,"cut":false,"hidden":false,"merged":[[45,0,45,5],[0,0,0,1],[0,3,0,5],[0,6,0,8],[11,1,11,3],[12,1,12,3],[0,12,0,14],[39,0,39,15],[0,9,0,11],[36,1,36,3],[37,1,37,3],[2,0,2,15],[8,0,8,5],[22,0,22,15],[28,0,28,5],[10,1,10,3],[30,2,30,5],[31,2,31,5],[29,1,29,5],[14,0,14,15],[20,0,20,5]]}
["PLN",null,null,"Jednostka organizacyjna",null,null,"Grupa tematyczna: Prawo",null,null,"Grupa tematyczna: Finanse",null,null,"Grupa tematyczna 3"]
["Lp.","Pracownik","Członek korpusu służby cywilnej","Dział","Wydział","Departament","Prawo administracyjne","Prawo finansów publicznych","Prawo zamówień publicznych","Audyt","Controling","Ekonomia","Tematyka 1","Tamatyka 2","Tematyka 3","Suma "]
["Planowane koszty szkoleń"]
[1,"Jan Kowalski",{"$f":"'Priorytety szkoleniowe'!C13","v":"tak"},null,null,null,{"$f":"IF('Planowanie szkoleń'!G$22=4,0,LOOKUP('Planowanie szkoleń'!G$22,'Ceny szkoleń'!$A$4:$A$6,'Ceny szkoleń'!F$4:F$6))*'Planowanie szkoleń'!G11*(1-'Ceny szkoleń'!F$8)","v":2000},{"$f":"IF('Planowanie szkoleń'!H$22=4,0,LOOKUP('Planowanie szkoleń'!H$22,'Ceny szkoleń'!$A$4:$A$6,'Ceny szkoleń'!G$4:G$6))*'Planowanie szkoleń'!H11*(1-'Ceny szkoleń'!G$8)","v":0},{"$f":"IF('Planowanie szkoleń'!I$22=4,0,LOOKUP('Planowanie szkoleń'!I$22,'Ceny szkoleń'!$A$4:$A$6,'Ceny szkoleń'!H$4:H$6))*'Planowanie szkoleń'!I11*(1-'Ceny szkoleń'!H$8)","v":0},{"$f":"IF('Planowanie szkoleń'!J$22=4,0,LOOKUP('Planowanie szkoleń'!J$22,'Ceny szkoleń'!$A$4:$A$6,'Ceny szkoleń'!I$4:I$6))*'Planowanie szkoleń'!J11*(1-'Ceny szkoleń'!I$8)","v":42},{"$f":"IF('Planowanie szkoleń'!K$22=4,0,LOOKUP('Planowanie szkoleń'!K$22,'Ceny szkoleń'!$A$4:$A$6,'Ceny szkoleń'!J$4:J$6))*'Planowanie szkoleń'!K11*(1-'Ceny szkoleń'!J$8)","v":200},{"$f":"IF('Planowanie szkoleń'!L$22=4,0,LOOKUP('Planowanie szkoleń'!L$22,'Ceny szkoleń'!$A$4:$A$6,'Ceny szkoleń'!K$4:K$6))*'Planowanie szkoleń'!L11*(1-'Ceny szkoleń'!K$8)","v":0},{"$f":"IF('Planowanie szkoleń'!M$22=4,0,LOOKUP('Planowanie szkoleń'!M$22,'Ceny szkoleń'!$A$4:$A$6,'Ceny szkoleń'!L$4:L$6))*'Planowanie szkoleń'!M11*(1-'Ceny szkoleń'!L$8)","v":300},{"$f":"IF('Planowanie szkoleń'!N$22=4,0,LOOKUP('Planowanie szkoleń'!N$22,'Ceny szkoleń'!$A$4:$A$6,'Ceny szkoleń'!M$4:M$6))*'Planowanie szkoleń'!N11*(1-'Ceny szkoleń'!M$8)","v":0},{"$f":"IF('Planowanie szkoleń'!O$22=4,0,LOOKUP('Planowanie szkoleń'!O$22,'Ceny szkoleń'!$A$4:$A$6,'Ceny szkoleń'!N$4:N$6))*'Planowanie szkoleń'!O11*(1-'Ceny szkoleń'!N$8)","v":0},{"$f":"SUM(G4:O4)","v":2542}]
[2,"Maria Nowak",{"$f":"'Priorytety szkoleniowe'!C14","v":"tak"},null,null,null,{"$f":"IF('Planowanie szkoleń'!G$22=4,0,LOOKUP('Planowanie szkoleń'!G$22,'Ceny szkoleń'!$A$4:$A$6,'Ceny szkoleń'!F$4:F$6))*'Planowanie szkoleń'!G12*(1-'Ceny szkoleń'!F$8)","v":0},{"$f":"IF('Planowanie szkoleń'!H$22=4,0,LOOKUP('Planowanie szkoleń'!H$22,'Ceny szkoleń'!$A$4:$A$6,'Ceny szkoleń'!G$4:G$6))*'Planowanie szkoleń'!H12*(1-'Ceny szkoleń'!G$8)","v":2000},{"$f":"IF('Planowanie szkoleń'!I$22=4,0,LOOKUP('Planowanie szkoleń'!I$22,'Ceny szkoleń'!$A$4:$A$6,'Ceny szkoleń'!H$4:H$6))*'Planowanie szkoleń'!I12*(1-'Ceny szkoleń'!H$8)","v":5000},{"$f":"IF('Planowanie szkoleń'!J$22=4,0,LOOKUP('Planowanie szkoleń'!J$22,'Ceny szkoleń'!$A$4:$A$6,'Ceny szkoleń'!I$4:I$6))*'Planowanie szkoleń'!J12*(1-'Ceny szkoleń'!I$8)","v":42},{"$f":"IF('Planowanie szkoleń'!K$22=4,0,LOOKUP('Planowanie szkoleń'!K$22,'Ceny szkoleń'!$A$4:$A$6,'Ceny szkoleń'!J$4:J$6))*'Planowanie szkoleń'!K12*(1-'Ceny szkoleń'!J$8)","v":0},{"$f":"IF('Planowanie szkoleń'!L$22=4,0,LOOKUP('Planowanie szkoleń'!L$22,'Ceny szkoleń'!$A$4:$A$6,'Ceny szkoleń'!K$4:K$6))*'Planowanie szkoleń'!L12*(1-'Ceny szkoleń'!K$8)","v":100},{"$f":"IF('Planowanie szkoleń'!M$22=4,0,LOOKUP('Planowanie szkoleń'!M$22,'Ceny szkoleń'!$A$4:$A$6,'Ceny szkoleń'!L$4:L$6))*'Planowanie szkoleń'!M12*(1-'Ceny szkoleń'!L$8)","v":300},{"$f":"IF('Planowanie szkoleń'!N$22=4,0,LOOKUP('Planowanie szkoleń'!N$22,'Ceny szkoleń'!$A$4:$A$6,'Ceny szkoleń'!M$4:M$6))*'Planowanie szkoleń'!N12*(1-'Ceny szkoleń'!M$8)","v":1500},{"$f":"IF('Planowanie szkoleń'!O$22=4,0,LOOKUP('Planowanie szkoleń'!O$22,'Ceny szkoleń'!$A$4:$A$6,'Ceny szkoleń'!N$4:N$6))*'Planowanie szkoleń'!O12*(1-'Ceny szkoleń'!N$8)","v":0},{"$f":"SUM(G5:O5)","v":8942}]
[3,"Piotr Krasinski",{"$f":"'Priorytety szkoleniowe'!C15","v":"tak"},null,null,null,{"$f":"IF('Planowanie szkoleń'!G$22=4,0,LOOKUP('Planowanie szkoleń'!G$22,'Ceny szkoleń'!$A$4:$A$6,'Ceny szkoleń'!F$4:F$6))*'Planowanie szkoleń'!G13*(1-'Ceny szkoleń'!F$8)","v":2000},{"$f":"IF('Planowanie szkoleń'!H$22=4,0,LOOKUP('Planowanie szkoleń'!H$22,'Ceny szkoleń'!$A$4:$A$6,'Ceny szkoleń'!G$4:G$6))*'Planowanie szkoleń'!H13*(1-'Ceny szkoleń'!G$8)","v":0},{"$f":"IF('Planowanie szkoleń'!I$22=4,0,LOOKUP('Planowanie szkoleń'!I$22,'Ceny szkoleń'!$A$4:$A$6,'Ceny szkoleń'!H$4:H$6))*'Planowanie szkoleń'!I13*(1-'Ceny szkoleń'!H$8)","v":5000},{"$f":"IF('Planowanie szkoleń'!J$22=4,0,LOOKUP('Planowanie szkoleń'!J$22,'Ceny szkoleń'!$A$4:$A$6,'Ceny szkoleń'!I$4:I$6))*'Planowanie szkoleń'!J13*(1-'Ceny szkoleń'!I$8)","v":42},{"$f":"IF('Planowanie szkoleń'!K$22=4,0,LOOKUP('Planowanie szkoleń'!K$22,'Ceny szkoleń'!$A$4:$A$6,'Ceny szkoleń'!J$4:J$6))*'Planowanie szkoleń'!K13*(1-'Ceny szkoleń'!J$8)","v":0},{"$f":"IF('Planowanie szkoleń'!L$22=4,0,LOOKUP('Planowanie szkoleń'!L$22,'Ceny szkoleń'!$A$4:$A$6,'Ceny szkoleń'!K$4:K$6))*'Planowanie szkoleń'!L13*(1-'Ceny szkoleń'!K$8)","v":0},{"$f":"IF('Planowanie szkoleń'!M$22=4,0,LOOKUP('Planowanie szkoleń'!M$22,'Ceny szkoleń'!$A$4:$A$6,'Ceny szkoleń'!L$4:L$6))*'Planowanie szkoleń'!M13*(1-'Ceny szkoleń'!L$8)","v":300},{"$f":"IF('Planowanie szkoleń'!N$22=4,0,LOOKUP('Planowanie szkoleń'!N$22,'Ceny szkoleń'!$A$4:$A$6,'Ceny szkoleń'!M$4:M$6))*'Planowanie szkoleń'!N13*(1-'Ceny szkoleń'!M$8)","v":0},{"$f":"IF('Planowanie szkoleń'!O$22=4,0,LOOKUP('Planowanie szkoleń'!O$22,'Ceny szkoleń'!$A$4:$A$6,'Ceny szkoleń'!N$4:N$6))*'Planowanie szkoleń'!O13*(1-'Ceny szkoleń'!N$8)","v":500},{"$f":"SUM(G6:O6)","v":7842}]
[4,null,{"$f":"'Priorytety szkoleniowe'!C16","v":"nie"},null,null,null,{"$f":"IF('Planowanie szkoleń'!G$22=4,0,LOOKUP('Planowanie szkoleń'!G$22,'Ceny szkoleń'!$A$4:$A$6,'Ceny szkoleń'!F$4:F$6))*'Planowanie szkoleń'!G14*(1-'Ceny szkoleń'!F$8)","v":0},{"$f":"IF('Planowanie szkoleń'!H$22=4,0,LOOKUP('Planowanie szkoleń'!H$22,'Ceny szkoleń'!$A$4:$A$6,'Ceny szkoleń'!G$4:G$6))*'Planowanie szkoleń'!H14*(1-'Ceny szkoleń'!G$8)","v":0},{"$f":"IF('Planowanie szkoleń'!I$22=4,0,LOOKUP('Planowanie szkoleń'!I$22,'Ceny szkoleń'!$A$4:$A$6,'Ceny szkoleń'!H$4:H$6))*'Planowanie szkoleń'!I14*(1-'Ceny szkoleń'!H$8)","v":0},{"$f":"IF('Planowanie szkoleń'!J$22=4,0,LOOKUP('Planowanie szkoleń'!J$22,'Ceny szkoleń'!$A$4:$A$6,'Ceny szkoleń'!I$4:I$6))*'Planowanie szkoleń'!J14*(1-'Ceny szkoleń'!I$8)","v":0},{"$f":"IF('Planowanie szkoleń'!K$22=4,0,LOOKUP('Planowanie szkoleń'!K$22,'Ceny szkoleń'!$A$4:$A$6,'Ceny szkoleń'!J$4:J$6))*'Planowanie szkoleń'!K14*(1-'Ceny szkoleń'!J$8)","v":0},{"$f":"IF('Planowanie szkoleń'!L$22=4,0,LOOKUP('Planowanie szkoleń'!L$22,'Ceny szkoleń'!$A$4:$A$6,'Ceny szkoleń'!K$4:K$6))*'Planowanie szkoleń'!L14*(1-'Ceny szkoleń'!K$8)","v":0},{"$f":"IF('Planowanie szkoleń'!M$22=4,0,LOOKUP('Planowanie szkoleń'!M$22,'Ceny szkoleń'!$A$4:$A$6,'Ceny szkoleń'!L$4:L$6))*'Planowanie szkoleń'!M14*(1-'Ceny szkoleń'!L$8)","v":0},{"$f":"IF('Planowanie szkoleń'!N$22=4,0,LOOKUP('Planowanie szkoleń'!N$22,'Ceny szkoleń'!$A$4:$A$6,'Ceny szkoleń'!M$4:M$6))*'Planowanie szkoleń'!N14*(1-'Ceny szkoleń'!M$8)","v":0},{"$f":"IF('Planowanie szkoleń'!O$22=4,0,LOOKUP('Planowanie szkoleń'!O$22,'Ceny szkoleń'!$A$4:$A$6,'Ceny szkoleń'!N$4:N$6))*'Planowanie szkoleń'!O14*(1-'Ceny szkoleń'!N$8)","v":0},{"$f":"SUM(G7:O7)","v":0}]
[5,null,{"$f":"'Priorytety szkoleniowe'!C17","v":"nie"},null,null,null,{"$f":"IF('Planowanie szkoleń'!G$22=4,0,LOOKUP('Planowanie szkoleń'!G$22,'Ceny szkoleń'!$A$4:$A$6,'Ceny szkoleń'!F$4:F$6))*'Planowanie szkoleń'!G15*(1-'Ceny szkoleń'!F$8)","v":0},{"$f":"IF('Planowanie szkoleń'!H$22=4,0,LOOKUP('Planowanie szkoleń'!H$22,'Ceny szkoleń'!$A$4:$A$6,'Ceny szkoleń'!G$4:G$6))*'Planowanie szkoleń'!H15*(1-'Ceny szkoleń'!G$8)","v":0},{"$f":"IF('Planowanie szkoleń'!I$22=4,0,LOOKUP('Planowanie szkoleń'!I$22,'Ceny szkoleń'!$A$4:$A$6,'Ceny szkoleń'!H$4:H$6))*'Planowanie szkoleń'!I15*(1-'Ceny szkoleń'!H$8)","v":0},{"$f":"IF('Planowanie szkoleń'!J$22=4,0,LOOKUP('Planowanie szkoleń'!J$22,'Ceny szkoleń'!$A$4:$A$6,'Ceny szkoleń'!I$4:I$6))*'Planowanie szkoleń'!J15*(1-'Ceny szkoleń'!I$8)","v":0},{"$f":"IF('Planowanie szkoleń'!K$22=4,0,LOOKUP('Planowanie szkoleń'!K$22,'Ceny szkoleń'!$A$4:$A$6,'Ceny szkoleń'!J$4:J$6))*'Planowanie szkoleń'!K15*(1-'Ceny szkoleń'!J$8)","v":0},{"$f":"IF('Planowanie szkoleń'!L$22=4,0,LOOKUP('Planowanie szkoleń'!L$22,'Ceny szkoleń'!$A$4:$A$6,'Ceny szkoleń'!K$4:K$6))*'Planowanie szkoleń'!L15*(1-'Ceny szkoleń'!K$8)","v":0},{"$f":"IF('Planowanie szkoleń'!M$22=4,0,LOOKUP('Planowanie szkoleń'!M$22,'Ceny szkoleń'!$A$4:$A$6,'Ceny szkoleń'!L$4:L$6))*'Planowanie szkoleń'!M15*(1-'Ceny szkoleń'!L$8)","v":0},{"$f":"IF('Planowanie szkoleń'!N$22=4,0,LOOKUP('Planowanie szkoleń'!N$22,'Ceny szkoleń'!$A$4:$A$6,'Ceny szkoleń'!M$4:M$6))*'Planowanie szkoleń'!N15*(1-'Ceny szkoleń'!M$8)","v":0},{"$f":"IF('Planowanie szkoleń'!O$22=4,0,LOOKUP('Planowanie szkoleń'!O$22,'Ceny szkoleń'!$A$4:$A$6,'Ceny szkoleń'!N$4:N$6))*'Planowanie szkoleń'!O15*(1-'Ceny szkoleń'!N$8)","v":0},{"$f":"SUM(G8:O8)","v":0}]
["Suma kosztów szkoleń",null,null,null,null,null,{"$f":"SUM(G4:G8)","v":4000},2000,10000,126,200,100,900,1500,500,19326]
[]
{"$rows_left_out":37}
{"sheet":"Ceny szkoleń - wykonanie","index":5,"n_rows":8,"n_cols":14,"rows_kept":8,"cut":false,"hidden":false,"merged":[[6,2,6,4],[7,2,7,4],[1,11,1,13],[2,2,2,4],[3,2,3,4],[4,2,4,4],[0,0,0,13],[1,2,1,4],[1,5,1,7],[1,8,1,10],[5,2,5,4]]}
["Szkolenia planowane"]
[null,null,null,null,null,"Grupa tematyczna: Prawo",null,null,"Grupa tematyczna: Finanse",null,null,"Grupa tematyczna 3"]
["Lp.","Podtyp szkolenia","Sposób wyliczenia ceny",null,null,"Prawo administracyjne","Prawo finansów publicznych","Prawo zamówień publicznych","Audyt","Controling","Ekonomia","Tematyka 1","Tamatyka 2","Tematyka 3"]
[1,"otwarte","cena za osobodzień",null,null,{"$f":"'Ceny szkoleń'!F4","v":1000},{"$f":"'Ceny szkoleń'!G4","v":1000},{"$f":"'Ceny szkoleń'!H4","v":1000},{"$f":"'Ceny szkoleń'!I4","v":200},{"$f":"'Ceny szkoleń'!J4","v":500},{"$f":"'Ceny szkoleń'!K4","v":200},{"$f":"'Ceny szkoleń'!L4","v":1000},{"$f":"'Ceny szkoleń'!M4","v":800},750]
[2,"zewnętrzne zamknięte","cena za osobodzień",null,null,{"$f":"'Ceny szkoleń'!F5","v":500},{"$f":"'Ceny szkoleń'!G5","v":500},{"$f":"'Ceny szkoleń'!H5","v":500},{"$f":"'Ceny szkoleń'!I5","v":80},{"$f":"'Ceny szkoleń'!J5","v":300},{"$f":"'Ceny szkoleń'!K5","v":80},{"$f":"'Ceny szkoleń'!L5","v":600},{"$f":"'Ceny szkoleń'!M5","v":500},{"$f":"'Ceny szkoleń'!N5","v":500}]
[3,"wewnętrzne zamknięte","cena za osobodzień",null,null,{"$f":"'Ceny szkoleń'!F6","v":250},{"$f":"'Ceny szkoleń'!G6","v":250},{"$f":"'Ceny szkoleń'!H6","v":200},{"$f":"'Ceny szkoleń'!I6","v":20},{"$f":"'Ceny szkoleń'!J6","v":200},{"$f":"'Ceny szkoleń'!K6","v":20},{"$f":"'Ceny szkoleń'!L6","v":50},{"$f":"'Ceny szkoleń'!M6","v":50},{"$f":"'Ceny szkoleń'!N6","v":50}]
[4]
[null,"Udział pracowników w finansowaniu","%",null,null,0,0,0,0,0,0,0.05,0.15,0.15]

{"sheet":"Wykonanie szkoleń ad hoc","index":6,"n_rows":30,"n_cols":15,"rows_kept":30,"cut":false,"hidden":false,"merged":[[23,2,24,5],[19,0,19,5],[2,6,2,8],[2,12,2,14],[1,0,1,14],[2,9,2,11],[2,3,2,5],[27,2,27,5],[28,2,28,5],[29,2,29,5],[9,0,9,5],[26,2,26,5],[11,0,11,14],[12,3,12,5],[12,6,12,8],[12,9,12,11],[12,12,12,14],[23,0,23,1],[22,0,22,14],[25,2,25,5],[23,6,23,8],[23,12,23,14],[23,9,23,11]]}
[]
["Przeprowadzone szkolenia ad hoc"]
[null,null,null,"Jednostka organizacyjna",null,null,"Grupa tematyczna: Prawo",null,null,"Grupa tematyczna: Finanse",null,null,"Grupa tematyczna 3"]
["Lp.","Pracownik","Członek korpusu służby cywilnej tak/nie","Dział","Wydział","Departament","Prawo administracyjne","Prawo finansów publicznych","Prawo zamówień publicznych","Audyt","Controling","Ekonomia","Tematyka 1","Tamatyka 2","Tematyka 3"]
[1,"Jan Kowalski","tak",null,null,null,1,null,null,1]
[2,"Maria Nowak","tak"]
[3,"Piotr Krasinski","tak"]
[4,null,"tak",null,null,null,null,null,null,null,null,null,null,null,1]
[5,null,"nie"]
["SUMA",null,null,null,null,null,{"$f":"SUM(G5:G9)","v":1},0,0,1,0,0,0,0,1]
{"$rows_left_out":21}
{"sheet":"Wykonanie planu","index":7,"n_rows":43,"n_cols":15,"rows_kept":43,"cut":false,"hidden":false,"merged":[[9,0,9,1],[2,0,2,11],[0,0,0,1],[0,2,0,4],[0,5,0,7],[0,8,0,10],[11,0,11,11],[18,0,18,1],[38,0,38,11],[39,0,39,1],[20,0,20,11],[27,0,27,1],[29,0,29,11],[36,0,36,1]]}
[null,null,"Grupa tematyczna: Prawo",null,null,"Grupa tematyczna: Finanse",null,null,"Grupa tematyczna 3"]
["Lp.","Szkolenie","Prawo administracyjne","Prawo finansów publicznych","Prawo zamówień publicznych","Audyt","Controling","Ekonomia","Tematyka 1","Tamatyka 2","Tematyka 3","Suma "]
["Wykonane szkolenia",null,null,null,null,null,null,null,null,null,null,null,null,"Bieżąca data",{"$f":"TODAY()","v":"2012-05-21"}]
[1,"szkolenie 1",{"$f":"IF('Planowanie szkoleń'!G24=0,0,IF($O$5-'Planowanie szkoleń'!G23>=0,1,0))","v":1},{"$f":"IF('Planowanie szkoleń'!H24=0,0,IF($O$5-'Planowanie szkoleń'!H23>=0,1,0))","v":1},{"$f":"IF('Planowanie szkoleń'!I24=0,0,IF($O$5-'Planowanie szkoleń'!I23>=0,1,0))","v":1},{"$f":"IF('Planowanie szkoleń'!J24=0,0,IF($O$5-'Planowanie szkoleń'!J23>=0,1,0))","v":1},{"$f":"IF('Planowanie szkoleń'!K24=0,0,IF($O$5-'Planowanie szkoleń'!K23>=0,1,0))","v":0},{"$f":"IF('Planowanie szkoleń'!L24=0,0,IF($O$5-'Planowanie szkoleń'!L23>=0,1,0))","v":0},{"$f":"IF('Planowanie szkoleń'!M24=0,0,IF($O$5-'Planowanie szkoleń'!M23>=0,1,0))","v":0},{"$f":"IF('Planowanie szkoleń'!N24=0,0,IF($O$5-'Planowanie szkoleń'!N23>=0,1,0))","v":0},{"$f":"IF('Planowanie szkoleń'!O24=0,0,IF($O$5-'Planowanie szkoleń'!O23>=0,1,0))","v":1},{"$f":"SUM(C4:K4)","v":5},null,"Początek roku","2012-01-01"]
[2,"szkolenie 2",{"$f":"IF('Planowanie szkoleń'!G25=0,0,IF($O$5-'Planowanie szkoleń'!G25>=0,1,0))","v":0},{"$f":"IF('Planowanie szkoleń'!H25=0,0,IF($O$5-'Planowanie szkoleń'!H25>=0,1,0))","v":0},{"$f":"IF('Planowanie szkoleń'!I25=0,0,IF($O$5-'Planowanie szkoleń'!I25>=0,1,0))","v":0},{"$f":"IF('Planowanie szkoleń'!J25=0,0,IF($O$5-'Planowanie szkoleń'!J25>=0,1,0))","v":0},{"$f":"IF('Planowanie szkoleń'!K25=0,0,IF($O$5-'Planowanie szkoleń'!K25>=0,1,0))","v":0},{"$f":"IF('Planowanie szkoleń'!L25=0,0,IF($O$5-'Planowanie szkoleń'!L25>=0,1,0))","v":0},{"$f":"IF('Planowanie szkoleń'!M25=0,0,IF($O$5-'Planowanie szkoleń'!M25>=0,1,0))","v":0},{"$f":"IF('Planowanie szkoleń'!N25=0,0,IF($O$5-'Planowanie szkoleń'!N25>=0,1,0))","v":0},{"$f":"IF('Planowanie szkoleń'!O25=0,0,IF($O$5-'Planowanie szkoleń'!O25>=0,1,0))","v":0},0,null,"miesiąc",{"$f":"CEILING((O3-O4)/30,1)","v":5}]
[3,"szkolenie 3",{"$f":"IF('Planowanie szkoleń'!G27=0,0,IF($O$5-'Planowanie szkoleń'!G27>=0,1,0))","v":0},{"$f":"IF('Planowanie szkoleń'!H27=0,0,IF($O$5-'Planowanie szkoleń'!H27>=0,1,0))","v":0},{"$f":"IF('Planowanie szkoleń'!I27=0,0,IF($O$5-'Planowanie szkoleń'!I27>=0,1,0))","v":0},{"$f":"IF('Planowanie szkoleń'!J27=0,0,IF($O$5-'Planowanie szkoleń'!J27>=0,1,0))","v":0},{"$f":"IF('Planowanie szkoleń'!K27=0,0,IF($O$5-'Planowanie szkoleń'!K27>=0,1,0))","v":0},{"$f":"IF('Planowanie szkoleń'!L27=0,0,IF($O$5-'Planowanie szkoleń'!L27>=0,1,0))","v":0},{"$f":"IF('Planowanie szkoleń'!M27=0,0,IF($O$5-'Planowanie szkoleń'!M27>=0,1,0))","v":0},{"$f":"IF('Planowanie szkoleń'!N27=0,0,IF($O$5-'Planowanie szkoleń'!N27>=0,1,0))","v":0},{"$f":"IF('Planowanie szkoleń'!O27=0,0,IF($O$5-'Planowanie szkoleń'!O27>=0,1,0))","v":0},0]
[4,null,null,null,null,null,null,null,null,null,null,0]
[5,null,null,null,null,null,null,null,null,null,null,0]
[null,"Szkolenia ad hoc",{"$f":"'Wykonanie szkoleń ad hoc'!G10","v":1},{"$f":"'Wykonanie szkoleń ad hoc'!H10","v":0},{"$f":"'Wykonanie szkoleń ad hoc'!I10","v":0},{"$f":"'Wykonanie szkoleń ad hoc'!J10","v":1},{"$f":"'Wykonanie szkoleń ad hoc'!K10","v":0},{"$f":"'Wykonanie szkoleń ad hoc'!L10","v":0},{"$f":"'Wykonanie szkoleń ad hoc'!M10","v":0},{"$f":"'Wykonanie szkoleń ad hoc'!N10","v":0},{"$f":"'Wykonanie szkoleń ad hoc'!O10","v":1},3]
["Liczba zrealizowanych szkoleń",null,{"$f":"SUM(C4:C9)","v":2},{"$f":"SUM(D4:D9)","v":1},1,2,0,0,0,0,2,{"$f":"SUM(L4:L9)","v":8}]
{"$rows_left_out":33}